{"text_format":"3","workbook":"xlsx","n_sheets":22,"sheets":["메인","설정","교과1","교과2","교과3","교과4","교과5","교과6","교과7","평가_교과","자유1","자유2","자유3","자유4","자유5","자유6","자유7","평가_자유","평가_종합","NEIS_교과","NEIS_자유","개인성적표"],"not_rendered":{"macros":1,"defined_names":45},"read":"whole","date_system":"1900"}

{"sheet":"메인","index":0,"n_rows":25,"n_cols":15,"rows_kept":25,"merged":[[1,5,1,7],[3,3,3,4],[5,7,5,8],[6,7,6,8],[7,7,7,8],[9,3,9,4],[9,5,9,6],[9,7,9,10],[10,2,16,2],[10,3,16,4],[10,5,10,6],[10,7,10,10],[11,5,11,6],[11,7,11,10],[12,5,12,6],[12,7,12,10],[13,5,13,6],[13,7,13,10],[14,5,14,6],[14,7,14,10],[15,5,15,6],[15,7,15,10],[16,5,16,6],[16,7,16,10],[17,2,23,2],[17,3,23,4],[17,5,17,6],[17,7,17,10],[18,5,18,6],[18,7,18,10],[19,5,19,6],[19,7,19,10],[20,5,20,6],[20,7,20,10],[21,5,21,6],[21,7,21,10],[22,5,22,6],[22,7,22,10],[23,5,23,6],[23,7,23,10],[24,7,24,10]]}
[]
[{"$nulls":5},"자유학기 평가 2.8"]
[]
[null,null,"학교명","충남중학교",null,"학년도",2018,"학기",2,"학년",1,{"$nulls":3},{"$f":"$G$4&\"_\"&$I$4&$H$4&\"_\"&$K$4&$J$4&\"_\"&$D$6&$C$6&\"_(\"&$D$7&\")\"","v":"2018_2학기_1학년_1반_(기술·가정)"}]
[]
[null,null,"반",1,"과정명","시수","지도교사","NEIS 과목(영역)",null,"평가요소","활동 기수"]
[null,null,"과목","기술·가정","교과",34,"김교과","기술·가정",null,{"v":4,"d":"4 개"},{"$nulls":4},{"$f":"G4&\"_\"&I4&H4&\"_\"&K4&J4&\"_\"&D6&C6&\"_(\"&D7&\")_\"&E7","v":"2018_2학기_1학년_1반_(기술·가정)_교과"}]
[null,null,"총시수",51,"자유학기 활동",{"$f":"D8-F7","v":17},"이자유","주제선택 활동",null,{"v":5,"d":"5 개"},"1기",{"$nulls":3},{"$f":"G4&\"_\"&I4&H4&\"_\"&K4&J4&\"_\"&D6&C6&\"_(\"&D7&\")_자유학기활동_\"&K8","v":"2018_2학기_1학년_1반_(기술·가정)_자유학기활동_1기"}]
[]
[null,null,"과정","단원 or 프로그램명",null,"평가 요소(항목)",null,"평가 내용"]
[null,null,"교과","청소년의 생활, \n기술과 발명",null,"형성평가 - 질문법",null,"옷차림과 자기표현(3문항), 주거와 거주환경(3문항), 기술과 발명의 세계(4문항)",{"$nulls":6},"교과 - 평가 요소(항목) 1"]
[{"$nulls":5},"형성평가 - 평가지",null,"옷차림과 자기표현(6문항), 주거와 거주환경(6문항), 기술과 발명의 세계(8문항)",{"$nulls":6},"교과 - 평가 요소(항목) 2"]
[{"$nulls":5},"포트폴리오 - 학습활동지",null,"개별 학습 활동지 작성 및 활용을 통하여 자기주도적 학습력을 강화함",{"$nulls":6},"교과 - 평가 요소(항목) 3"]
[{"$nulls":5},"마인드 맵 작성",null,"기술적 문제 해결을 목적으로 시각적인 아이디어 구상을 할 수 있는 마인드 맵 프로그램(알마인드)을 활용하여 아이디어를 표현 할 수 있음",{"$nulls":6},"교과 - 평가 요소(항목) 4"]
[{"$nulls":14},"교과 - 평가 요소(항목) 5"]
[{"$nulls":14},"교과 - 평가 요소(항목) 6"]
[{"$nulls":14},"교과 - 평가 요소(항목) 7"]
[null,null,"자유학기\n활동","뚝딱뚝딱 창의공작",null,"재료의 가공",null,"각종 재료(종이, 우드락, 목재 등)를 원하는 치수와 모양대로 공구를 이용하여 가공할 수 있음",{"$nulls":6},"자유학기 활동 - 평가 요소(항목) 1"]
[{"$nulls":5},"전통 한옥 목재 맞춤 제작",null,"부품의 정확한 가공 및 다듬기 상태, 부품 간 끼워 맞춤 상태와 접합의 견고함",{"$nulls":6},"자유학기 활동 - 평가 요소(항목) 2"]
[{"$nulls":5},"창의적 계단 모형 만들기",null,"부품의 정확한 가공 및 다듬기 상태, 접착제를 이용한 부품의 조립과 연결 상태, 입체 공간에서의 창의적인 계단 구조와 기능",{"$nulls":6},"자유학기 활동 - 평가 요소(항목) 3"]
[{"$nulls":5},"창의적 모형주택 만들기",null,"태양광 이용의 친환경 주택 및 전통 한옥 구조물 이해를 위한 조립형 키트 방식 한옥 제작 후 창의적으로 꾸미기",{"$nulls":6},"자유학기 활동 - 평가 요소(항목) 4"]
[{"$nulls":5},"창의적 교량 만들기",null,"교량의 일반적인 구조물에 대한 이해를 통하여 주어진 재료를 이용하여 창의적인 교량 구조물을 만들 수 있음",{"$nulls":6},"자유학기 활동 - 평가 요소(항목) 5"]
[{"$nulls":14},"자유학기 활동 - 평가 요소(항목) 6"]
[{"$nulls":14},"자유학기 활동 - 평가 요소(항목) 7"]
[{"$nulls":7},{"$f":"D4&\"학업성적관리위원회\"","v":"충남중학교학업성적관리위원회"}]

{"sheet":"설정","index":1,"n_rows":44,"n_cols":10,"rows_kept":44,"merged":[[1,2,1,3],[1,5,1,9],[4,8,7,8],[5,5,7,5],[9,5,11,5],[13,5,14,5],[16,5,22,5]]}
[]
[null,null,"학적 사항",null,null,"자유학기 NEIS 과목 편성, 자유학기 활동"]
[]
[null,null,"번","이름",null,"교과군","과목명",null,"기본 활동","세부 활동"]
[null,null,1,"학생 1",null,"국어","국어",null,"자유학기 활동","진로탐색 활동"]
[null,null,2,"학생 2",null,"사회(역사포함)/도덕","사회",null,null,"주제선택 활동"]
[null,null,3,"학생 3",null,null,"역사",null,null,"예술·체육 활동"]
[null,null,4,"학생 4",null,null,"도덕",null,null,"동아리 활동"]
[null,null,5,"학생 5",null,"수학","수학"]
[null,null,6,"학생 6",null,"과학/기술·가정/정보","과학"]
[null,null,7,"학생 7",null,null,"기술·가정"]
[null,null,8,"학생 8",null,null,"정보"]
[null,null,9,"학생 9",null,"체육","체육"]
[null,null,10,"학생10",null,"예술(음악/미술)","음악"]
[null,null,11,"학생11",null,null,"미술"]
[null,null,12,"학생12",null,"영어","영어"]
[null,null,13,"학생13",null,"선택","한문"]
[null,null,14,"학생14",null,null,"생활외국어"]
[null,null,15,"학생15",null,null,"환경"]
[null,null,16,"학생16",null,null,"보건"]
[null,null,17,"학생17",null,null,"진로와 직업"]
[null,null,18,"학생18",null,null,"철학"]
[null,null,19,"학생19"]
[null,null,20,"학생20"]
[null,null,21,"학생21"]
[null,null,22,"학생22"]
[null,null,23,"학생23"]
[null,null,24,"학생24"]
[null,null,25,"학생25"]
[null,null,26]
[null,null,27]
[null,null,28]
[null,null,29]
[null,null,30]
[null,null,31]
[null,null,32]
[null,null,33]
[null,null,34]
[null,null,35]
[null,null,36]
[null,null,37]
[null,null,38]
[null,null,39]
[null,null,40]

{"sheet":"교과1","index":2,"n_rows":12,"n_cols":5,"rows_kept":12,"merged":[[1,2,1,4],[2,2,2,4],[4,4,5,4]]}
[]
[null,null,{"$f":"\"자유학기 과정 중심 평가 결과 서술 내용 (\"&메인!H7&\") - 1\"","v":"자유학기 과정 중심 평가 결과 서술 내용 (기술·가정) - 1"}]
[null,null,"( 등급을 판정하는 기준이 아니라, 평가 결과로서 학교생활기록부에 특기사항으로 기록될 등급별 내용 입니다. )"]
[]
[null,null,"평가 주제",{"$f":"IF(메인!J7>=1,메인!F11,\"\")","v":"형성평가 - 질문법"},"글자 수\n\n(참고)"]
[null,null,"평가 내용",{"$f":"IF(메인!J7>=1,메인!H11,\"\")","v":"옷차림과 자기표현(3문항), 주거와 거주환경(3문항), 기술과 발명의 세계(4문항)"}]
[null,null,"A","질문의 핵심 내용을 분명하게 알고 자신있는 답변을 정확하게 하였으며,",{"$f":"IF(D7=\"\",\"\",LEN(D7))","v":38}]
[null,null,"B","질문의 핵심 내용을 어느정도 알고 답변을 알맞게 잘 하였으며,",{"$f":"IF(D8=\"\",\"\",LEN(D8))","v":34}]
[null,null,"C","질문의 핵심 내용에 대한 이해가 부족하여 답변의 내용이 부실하였으며,",{"$f":"IF(D9=\"\",\"\",LEN(D9))","v":38}]
[null,null,"D",null,{"$f":"IF(D10=\"\",\"\",LEN(D10))","v":""}]
[null,null,"E",null,{"$f":"IF(D11=\"\",\"\",LEN(D11))","v":""}]
[{"$nulls":4},{"$f":"메인!D4&\"학업성적관리위원회\"","v":"충남중학교학업성적관리위원회"}]

{"sheet":"교과2","index":3,"n_rows":12,"n_cols":5,"rows_kept":12,"merged":[[1,2,1,4],[2,2,2,4],[4,4,5,4]]}
[]
[null,null,{"$f":"\"자유학기 과정 중심 평가 결과 서술 내용 (\"&메인!H7&\") - 2\"","v":"자유학기 과정 중심 평가 결과 서술 내용 (기술·가정) - 2"}]
[null,null,"( 등급을 판정하는 기준이 아니라, 평가 결과로서 학교생활기록부에 특기사항으로 기록될 등급별 내용 입니다. )"]
[]
[null,null,"평가 주제",{"$f":"IF(메인!J7>=2,메인!F12,\"\")","v":"형성평가 - 평가지"},"글자 수\n\n(참고)"]
[null,null,"평가 내용",{"$f":"IF(메인!J7>=2,메인!H12,\"\")","v":"옷차림과 자기표현(6문항), 주거와 거주환경(6문항), 기술과 발명의 세계(8문항)"}]
[null,null,"A","단원에 대한 기본적인 학습활동이 잘 되어있어 용어의 이해와 개념 파악이 우수함.",{"$f":"IF(D7=\"\",\"\",LEN(D7))","v":44}]
[null,null,"B","단원에 대한 기본적인 학습활동이 다소 부족하나 일반적인 용어의 개념파악이 양호함.",{"$f":"IF(D8=\"\",\"\",LEN(D8))","v":45}]
[null,null,"C","단원에 대한 기본 학습 활동이 부족하여 용어와 개념의 이해도가 낮음.",{"$f":"IF(D9=\"\",\"\",LEN(D9))","v":38}]
[null,null,"D",null,{"$f":"IF(D10=\"\",\"\",LEN(D10))","v":""}]
[null,null,"E",null,{"$f":"IF(D11=\"\",\"\",LEN(D11))","v":""}]
[{"$nulls":4},{"$f":"메인!D4&\"학업성적관리위원회\"","v":"충남중학교학업성적관리위원회"}]

{"sheet":"교과3","index":4,"n_rows":12,"n_cols":5,"rows_kept":12,"merged":[[1,2,1,4],[2,2,2,4],[4,4,5,4]]}
[]
[null,null,{"$f":"\"자유학기 과정 중심 평가 결과 서술 내용 (\"&메인!H7&\") - 3\"","v":"자유학기 과정 중심 평가 결과 서술 내용 (기술·가정) - 3"}]
[null,null,"( 등급을 판정하는 기준이 아니라, 평가 결과로서 학교생활기록부에 특기사항으로 기록될 등급별 내용 입니다. )"]
[]
[null,null,"평가 주제",{"$f":"IF(메인!J7>=3,메인!F13,\"\")","v":"포트폴리오 - 학습활동지"},"글자 수\n\n(참고)"]
[null,null,"평가 내용",{"$f":"IF(메인!J7>=3,메인!H13,\"\")","v":"개별 학습 활동지 작성 및 활용을 통하여 자기주도적 학습력을 강화함"}]
[null,null,"A","수업활동에 적극적인 태도를 가지고 학습활동지를 수업과 연계하여 충실히 작성함으로써 교사의 질문에 대한 핵심 내용을 잘 파악하여 정확한 답변을 할 수 있는 학습 능력을 발휘함.",{"$f":"IF(D7=\"\",\"\",LEN(D7))","v":97}]
[null,null,"B","수업활동에 관심을 가지고 학습활동지를 수업과 연계하여 적절히 작성하였으며 교사의 질문에 대한 핵심 내용을 잘 파악하여 적절한 답변을 할 수 있는 학습 능력을 발휘함.",{"$f":"IF(D8=\"\",\"\",LEN(D8))","v":92}]
[null,null,"C","수업활동에 기본적인 태도를 가지고 학습활동지를 적절히 작성하였으며 교사의 질문에 대한 내용을 어느정도 파악하여 일부분 답변을 할 수 있는 학습 능력을 발휘함.",{"$f":"IF(D9=\"\",\"\",LEN(D9))","v":88}]
[null,null,"D",null,{"$f":"IF(D10=\"\",\"\",LEN(D10))","v":""}]
[null,null,"E",null,{"$f":"IF(D11=\"\",\"\",LEN(D11))","v":""}]
[{"$nulls":4},{"$f":"메인!D4&\"학업성적관리위원회\"","v":"충남중학교학업성적관리위원회"}]

{"sheet":"교과4","index":5,"n_rows":12,"n_cols":5,"rows_kept":12,"merged":[[1,2,1,4],[2,2,2,4],[4,4,5,4]]}
[]
[null,null,{"$f":"\"자유학기 과정 중심 평가 결과 서술 내용 (\"&메인!H7&\") - 4\"","v":"자유학기 과정 중심 평가 결과 서술 내용 (기술·가정) - 4"}]
[null,null,"( 등급을 판정하는 기준이 아니라, 평가 결과로서 학교생활기록부에 특기사항으로 기록될 등급별 내용 입니다. )"]
[]
[null,null,"평가 주제",{"$f":"IF(메인!J7>=4,메인!F14,\"\")","v":"마인드 맵 작성"},"글자 수\n\n(참고)"]
[null,null,"평가 내용",{"$f":"IF(메인!J7>=4,메인!H14,\"\")","v":"기술적 문제 해결을 목적으로 시각적인 아이디어 구상을 할 수 있는 마인드 맵 프로그램(알마인드)을 활용하여 아이디어를 표현 할 수 있음"}]
[null,null,"A","아이디어를 시각적으로 디자인하여 알기 쉽게 표현하는 알마인드맵 프로그램의 고급 기능에 익숙하여 사용을 매우 잘 함. 생활 속의 문제를 발견하고 해결하고자 하는 구체적인 노력을 마인드맵 프로그램으로 매우 잘 표현할 수 있음. 토픽과 서브토픽 내용의 상호 관련성이 매우 적절하며 디자인 요소의 표현이 잘 되어있고 안정감 있게 배치함으로써 전체 맵의 이해도를 높였음.",{"$f":"IF(D7=\"\",\"\",LEN(D7))","v":202}]
[null,null,"B","시각적으로 아이디어를 디자인하여 알기 쉽게 표현하는 알마인드맵 프로그램의 기본적인 기능을 활용 할 수 있음. 생활 속의 문제를 발견하고 해결하고자 하는 일반적인 노력을 마인드맵 프로그램으로 알맞게 표현함. 토픽과 서브토픽의 디자인 표현이 대체로 잘 되어있고 안정감 있게 배치되었음.",{"$f":"IF(D8=\"\",\"\",LEN(D8))","v":157}]
[null,null,"C","구상된 아이디어를 알기 쉽게 표현하는 알마인드맵 프로그램의 기본적인 사용을 할 수 있음. 생활 속의 문제를 발견하고 해결하고자 하는 기본적인 노력을 마인드맵 프로그램으로 적절히 표현함. 맵의 디자인 표현이 잘 되어있고 토픽이 안정감 있게 배치됨.",{"$f":"IF(D9=\"\",\"\",LEN(D9))","v":137}]
[null,null,"D",null,{"$f":"IF(D10=\"\",\"\",LEN(D10))","v":""}]
[null,null,"E",null,{"$f":"IF(D11=\"\",\"\",LEN(D11))","v":""}]
[{"$nulls":4},{"$f":"메인!D4&\"학업성적관리위원회\"","v":"충남중학교학업성적관리위원회"}]

{"sheet":"교과5","index":6,"n_rows":12,"n_cols":5,"rows_kept":12,"merged":[[1,2,1,4],[2,2,2,4],[4,4,5,4]]}
[]
[null,null,{"$f":"\"자유학기 과정 중심 평가 결과 서술 내용 (\"&메인!H7&\") - 5\"","v":"자유학기 과정 중심 평가 결과 서술 내용 (기술·가정) - 5"}]
[null,null,"( 등급을 판정하는 기준이 아니라, 평가 결과로서 학교생활기록부에 특기사항으로 기록될 등급별 내용 입니다. )"]
[]
[null,null,"평가 주제",{"$f":"IF(메인!J7>=5,메인!F15,\"\")","v":""},"글자 수\n\n(참고)"]
[null,null,"평가 내용",{"$f":"IF(메인!J7>=5,메인!H15,\"\")","v":""}]
[null,null,"A",null,{"$f":"IF(D7=\"\",\"\",LEN(D7))","v":""}]
[null,null,"B",null,{"$f":"IF(D8=\"\",\"\",LEN(D8))","v":""}]
[null,null,"C",null,{"$f":"IF(D9=\"\",\"\",LEN(D9))","v":""}]
[null,null,"D",null,{"$f":"IF(D10=\"\",\"\",LEN(D10))","v":""}]
[null,null,"E",null,{"$f":"IF(D11=\"\",\"\",LEN(D11))","v":""}]
[{"$nulls":4},{"$f":"메인!D4&\"학업성적관리위원회\"","v":"충남중학교학업성적관리위원회"}]

{"sheet":"교과6","index":7,"n_rows":12,"n_cols":5,"rows_kept":12,"merged":[[1,2,1,4],[2,2,2,4],[4,4,5,4]]}
[]
[null,null,{"$f":"\"자유학기 과정 중심 평가 결과 서술 내용 (\"&메인!H7&\") - 6\"","v":"자유학기 과정 중심 평가 결과 서술 내용 (기술·가정) - 6"}]
[null,null,"( 등급을 판정하는 기준이 아니라, 평가 결과로서 학교생활기록부에 특기사항으로 기록될 등급별 내용 입니다. )"]
[]
[null,null,"평가 주제",{"$f":"IF(메인!J7>=6,메인!F16,\"\")","v":""},"글자 수\n\n(참고)"]
[null,null,"평가 내용",{"$f":"IF(메인!J7>=6,메인!H16,\"\")","v":""}]
[null,null,"A",null,{"$f":"IF(D7=\"\",\"\",LEN(D7))","v":""}]
[null,null,"B",null,{"$f":"IF(D8=\"\",\"\",LEN(D8))","v":""}]
[null,null,"C",null,{"$f":"IF(D9=\"\",\"\",LEN(D9))","v":""}]
[null,null,"D",null,{"$f":"IF(D10=\"\",\"\",LEN(D10))","v":""}]
[null,null,"E",null,{"$f":"IF(D11=\"\",\"\",LEN(D11))","v":""}]
[{"$nulls":4},{"$f":"메인!D4&\"학업성적관리위원회\"","v":"충남중학교학업성적관리위원회"}]

{"sheet":"교과7","index":8,"n_rows":12,"n_cols":5,"rows_kept":12,"merged":[[1,2,1,4],[2,2,2,4],[4,4,5,4]]}
[]
[null,null,{"$f":"\"자유학기 과정 중심 평가 결과 서술 내용 (\"&메인!H7&\") - 7\"","v":"자유학기 과정 중심 평가 결과 서술 내용 (기술·가정) - 7"}]
[null,null,"( 등급을 판정하는 기준이 아니라, 평가 결과로서 학교생활기록부에 특기사항으로 기록될 등급별 내용 입니다. )"]
[]
[null,null,"평가 주제",{"$f":"IF(메인!J7>=7,메인!F17,\"\")","v":""},"글자 수\n\n(참고)"]
[null,null,"평가 내용",{"$f":"IF(메인!J7>=7,메인!H17,\"\")","v":""}]
[null,null,"A",null,{"$f":"IF(D7=\"\",\"\",LEN(D7))","v":""}]
[null,null,"B",null,{"$f":"IF(D8=\"\",\"\",LEN(D8))","v":""}]
[null,null,"C",null,{"$f":"IF(D9=\"\",\"\",LEN(D9))","v":""}]
[null,null,"D",null,{"$f":"IF(D10=\"\",\"\",LEN(D10))","v":""}]
[null,null,"E",null,{"$f":"IF(D11=\"\",\"\",LEN(D11))","v":""}]
[{"$nulls":4},{"$f":"메인!D4&\"학업성적관리위원회\"","v":"충남중학교학업성적관리위원회"}]

{"sheet":"평가_교과","index":9,"n_rows":47,"n_cols":24,"rows_kept":47,"merged":[[1,2,1,11],[4,2,5,2],[4,3,5,3],[4,4,5,4],[4,5,5,5],[4,6,5,6],[4,7,5,7],[4,8,5,8],[4,9,5,9],[4,10,5,10],[4,11,5,11],[4,14,5,14],[4,15,5,15],[4,16,5,16],[4,17,5,17],[4,18,5,18],[4,19,5,19],[4,20,5,20],[4,22,5,22],[4,23,5,23]]}
[]
[null,null,{"$f":"\"자유학기 과정 중심 평가 결과 (교과 - \"&메인!H7&\")\"","v":"자유학기 과정 중심 평가 결과 (교과 - 기술·가정)"}]
[]
[null,null,{"$f":"메인!G4&메인!F4&\"  \"&메인!I4&메인!H4&\"  \"&메인!K4&메인!J4&\"  \"&메인!D6&메인!C6","v":"2018학년도  2학기  1학년  1반"},{"$nulls":8},{"$f":"\"지도교사 : \"&메인!G7&\"  (인)\"","v":"지도교사 : 김교과  (인)"}]
[null,null,"번호","성명",{"$f":"IF(메인!J7>=1,메인!F11,\"\")","v":"형성평가 - 질문법"},{"$f":"IF(메인!J7>=2,메인!F12,\"\")","v":"형성평가 - 평가지"},{"$f":"IF(메인!J7>=3,메인!F13,\"\")","v":"포트폴리오 - 학습활동지"},{"$f":"IF(메인!J7>=4,메인!F14,\"\")","v":"마인드 맵 작성"},{"$f":"IF(메인!J7>=5,메인!F15,\"\")","v":""},{"$f":"IF(메인!J7>=6,메인!F16,\"\")","v":""},{"$f":"IF(메인!J7>=7,메인!F17,\"\")","v":""},"비  고",null,null,{"$f":"IF(메인!J7>=1,메인!F11,\"\")","v":"형성평가 - 질문법"},{"$f":"IF(메인!J7>=2,메인!F12,\"\")","v":"형성평가 - 평가지"},{"$f":"IF(메인!J7>=3,메인!F13,\"\")","v":"포트폴리오 - 학습활동지"},{"$f":"IF(메인!J7>=4,메인!F14,\"\")","v":"마인드 맵 작성"},{"$f":"IF(메인!J7>=5,메인!F15,\"\")","v":""},{"$f":"IF(메인!J7>=6,메인!F16,\"\")","v":""},{"$f":"IF(메인!J7>=7,메인!F17,\"\")","v":""},null,{"$f":"메인!J7","v":4},"글자 수"]
[]
[null,null,1,{"$f":"IF(설정!D5=\"\",\"\",설정!D5)","v":"학생 1"},"C","B","A","B",{"$nulls":6},{"$f":"IF(OR($E$5=\"\",E7=\"전입\",E7=\"전출\",E7=\"\"),\"\",VLOOKUP(E7,서술_공통1,2,FALSE))","v":"질문의 핵심 내용에 대한 이해가 부족하여 답변의 내용이 부실하였으며,"},{"$f":"IF(OR($F$5=\"\",F7=\"전입\",F7=\"전출\",F7=\"\"),\"\",VLOOKUP(F7,서술_공통2,2,FALSE))","v":"단원에 대한 기본적인 학습활동이 다소 부족하나 일반적인 용어의 개념파악이 양호함."},{"$f":"IF(OR($G$5=\"\",G7=\"전입\",G7=\"전출\",G7=\"\"),\"\",VLOOKUP(G7,서술_공통3,2,FALSE))","v":"수업활동에 적극적인 태도를 가지고 학습활동지를 수업과 연계하여 충실히 작성함으로써 교사의 질문에 대한 핵심 내용을 잘 파악하여 정확한 답변을 할 수 있는 학습 능력을 발휘함."},{"$f":"IF(OR($H$5=\"\",H7=\"전입\",H7=\"전출\",H7=\"\"),\"\",VLOOKUP(H7,서술_공통4,2,FALSE))","v":"시각적으로 아이디어를 디자인하여 알기 쉽게 표현하는 알마인드맵 프로그램의 기본적인 기능을 활용 할 수 있음. 생활 속의 문제를 발견하고 해결하고자 하는 일반적인 노력을 마인드맵 프로그램으로 알맞게 표현함. 토픽과 서브토픽의 디자인 표현이 대체로 잘 되어있고 안정감 있게 배치되었음."},{"$f":"IF(OR($I$5=\"\",I7=\"전입\",I7=\"전출\",I7=\"\"),\"\",VLOOKUP(I7,서술_공통5,2,FALSE))","v":""},{"$f":"IF(OR($J$5=\"\",J7=\"전입\",J7=\"전출\",J7=\"\"),\"\",VLOOKUP(J7,서술_공통6,2,FALSE))","v":""},{"$f":"IF(OR($K$5=\"\",K7=\"전입\",K7=\"전출\",K7=\"\"),\"\",VLOOKUP(K7,서술_공통7,2,FALSE))","v":""},null,{"$f":"IF(COUNTBLANK(O7:U7)=7,\"\",IF($W$5=1,O7,IF($W$5=2,O7&\" \"&P7,IF($W$5=3,O7&\" \"&P7&\" \"&Q7,IF($W$5=4,O7&\" \"&P7&\" \"&Q7&\" \"&R7,IF($W$5=5,O7&\" \"&P7&\" \"&Q7&\" \"&R7&\" \"&S7,IF($W$5=6,O7&\" \"&P7&\" \"&Q7&\" \"&R7&\" \"&S7&\" \"&T7,IF($W$5=7,O7&\" \"&P7&\" \"&Q7&\" \"&R7&\" \"&S7&\" \"&T7&\" \"&U7,\"\"))))))))","v":"질문의 핵심 내용에 대한 이해가 부족하여 답변의 내용이 부실하였으며, 단원에 대한 기본적인 학습활동이 다소 부족하나 일반적인 용어의 개념파악이 양호함. 수업활동에 적극적인 태도를 가지고 학습활동지를 수업과 연계하여 충실히 작성함으로써 교사의 질문에 대한 핵심 내용을 잘 파악하여 정확한 답변을 할 수 있는 학습 능력을 발휘함. 시각적으로 아이디어를 디자인하여 알기 쉽게 표현하는 알마인드맵 프로그램의 기본적인 기능을 활용 할 수 있음. 생활 속의 문제를 발견하고 해결하고자 하는 일반적인 노력을 마인드맵 프로그램으로 알맞게 표현함. 토픽과 서브토픽의 디자인 표현이 대체로 잘 되어있고 안정감 있게 배치되었음."},{"$f":"LEN(W7)","v":340}]
[null,null,2,{"$f":"IF(설정!D6=\"\",\"\",설정!D6)","v":"학생 2"},"B","A","C","A",{"$nulls":6},{"$f":"IF(OR($E$5=\"\",E8=\"전입\",E8=\"전출\",E8=\"\"),\"\",VLOOKUP(E8,서술_공통1,2,FALSE))","v":"질문의 핵심 내용을 어느정도 알고 답변을 알맞게 잘 하였으며,"},{"$f":"IF(OR($F$5=\"\",F8=\"전입\",F8=\"전출\",F8=\"\"),\"\",VLOOKUP(F8,서술_공통2,2,FALSE))","v":"단원에 대한 기본적인 학습활동이 잘 되어있어 용어의 이해와 개념 파악이 우수함."},{"$f":"IF(OR($G$5=\"\",G8=\"전입\",G8=\"전출\",G8=\"\"),\"\",VLOOKUP(G8,서술_공통3,2,FALSE))","v":"수업활동에 기본적인 태도를 가지고 학습활동지를 적절히 작성하였으며 교사의 질문에 대한 내용을 어느정도 파악하여 일부분 답변을 할 수 있는 학습 능력을 발휘함."},{"$f":"IF(OR($H$5=\"\",H8=\"전입\",H8=\"전출\",H8=\"\"),\"\",VLOOKUP(H8,서술_공통4,2,FALSE))","v":"아이디어를 시각적으로 디자인하여 알기 쉽게 표현하는 알마인드맵 프로그램의 고급 기능에 익숙하여 사용을 매우 잘 함. 생활 속의 문제를 발견하고 해결하고자 하는 구체적인 노력을 마인드맵 프로그램으로 매우 잘 표현할 수 있음. 토픽과 서브토픽 내용의 상호 관련성이 매우 적절하며 디자인 요소의 표현이 잘 되어있고 안정감 있게 배치함으로써 전체 맵의 이해도를 높였음."},{"$f":"IF(OR($I$5=\"\",I8=\"전입\",I8=\"전출\",I8=\"\"),\"\",VLOOKUP(I8,서술_공통5,2,FALSE))","v":""},{"$f":"IF(OR($J$5=\"\",J8=\"전입\",J8=\"전출\",J8=\"\"),\"\",VLOOKUP(J8,서술_공통6,2,FALSE))","v":""},{"$f":"IF(OR($K$5=\"\",K8=\"전입\",K8=\"전출\",K8=\"\"),\"\",VLOOKUP(K8,서술_공통7,2,FALSE))","v":""},null,{"$f":"IF(COUNTBLANK(O8:U8)=7,\"\",IF($W$5=1,O8,IF($W$5=2,O8&\" \"&P8,IF($W$5=3,O8&\" \"&P8&\" \"&Q8,IF($W$5=4,O8&\" \"&P8&\" \"&Q8&\" \"&R8,IF($W$5=5,O8&\" \"&P8&\" \"&Q8&\" \"&R8&\" \"&S8,IF($W$5=6,O8&\" \"&P8&\" \"&Q8&\" \"&R8&\" \"&S8&\" \"&T8,IF($W$5=7,O8&\" \"&P8&\" \"&Q8&\" \"&R8&\" \"&S8&\" \"&T8&\" \"&U8,\"\"))))))))","v":"질문의 핵심 내용을 어느정도 알고 답변을 알맞게 잘 하였으며, 단원에 대한 기본적인 학습활동이 잘 되어있어 용어의 이해와 개념 파악이 우수함. 수업활동에 기본적인 태도를 가지고 학습활동지를 적절히 작성하였으며 교사의 질문에 대한 내용을 어느정도 파악하여 일부분 답변을 할 수 있는 학습 능력을 발휘함. 아이디어를 시각적으로 디자인하여 알기 쉽게 표현하는 알마인드맵 프로그램의 고급 기능에 익숙하여 사용을 매우 잘 함. 생활 속의 문제를 발견하고 해결하고자 하는 구체적인 노력을 마인드맵 프로그램으로 매우 잘 표현할 수 있음. 토픽과 서브토픽 내용의 상호 관련성이 매우 적절하며 디자인 요소의 표현이 잘 되어있고 안정감 있게 배치함으로써 전체 맵의 이해도를 높였음."},{"$f":"LEN(W8)","v":371}]
[null,null,3,{"$f":"IF(설정!D7=\"\",\"\",설정!D7)","v":"학생 3"},"C","B","A","B",{"$nulls":6},"질문의 핵심 내용에 대한 이해가 부족하여 답변의 내용이 부실하였으며,","단원에 대한 기본적인 학습활동이 다소 부족하나 일반적인 용어의 개념파악이 양호함.","수업활동에 적극적인 태도를 가지고 학습활동지를 수업과 연계하여 충실히 작성함으로써 교사의 질문에 대한 핵심 내용을 잘 파악하여 정확한 답변을 할 수 있는 학습 능력을 발휘함.","시각적으로 아이디어를 디자인하여 알기 쉽게 표현하는 알마인드맵 프로그램의 기본적인 기능을 활용 할 수 있음. 생활 속의 문제를 발견하고 해결하고자 하는 일반적인 노력을 마인드맵 프로그램으로 알맞게 표현함. 토픽과 서브토픽의 디자인 표현이 대체로 잘 되어있고 안정감 있게 배치되었음.","","","",null,"질문의 핵심 내용에 대한 이해가 부족하여 답변의 내용이 부실하였으며, 단원에 대한 기본적인 학습활동이 다소 부족하나 일반적인 용어의 개념파악이 양호함. 수업활동에 적극적인 태도를 가지고 학습활동지를 수업과 연계하여 충실히 작성함으로써 교사의 질문에 대한 핵심 내용을 잘 파악하여 정확한 답변을 할 수 있는 학습 능력을 발휘함. 시각적으로 아이디어를 디자인하여 알기 쉽게 표현하는 알마인드맵 프로그램의 기본적인 기능을 활용 할 수 있음. 생활 속의 문제를 발견하고 해결하고자 하는 일반적인 노력을 마인드맵 프로그램으로 알맞게 표현함. 토픽과 서브토픽의 디자인 표현이 대체로 잘 되어있고 안정감 있게 배치되었음.",340]
[null,null,4,{"$f":"IF(설정!D8=\"\",\"\",설정!D8)","v":"학생 4"},"A","A","B","C",{"$nulls":6},"질문의 핵심 내용을 분명하게 알고 자신있는 답변을 정확하게 하였으며,","단원에 대한 기본적인 학습활동이 잘 되어있어 용어의 이해와 개념 파악이 우수함.","수업활동에 관심을 가지고 학습활동지를 수업과 연계하여 적절히 작성하였으며 교사의 질문에 대한 핵심 내용을 잘 파악하여 적절한 답변을 할 수 있는 학습 능력을 발휘함.","구상된 아이디어를 알기 쉽게 표현하는 알마인드맵 프로그램의 기본적인 사용을 할 수 있음. 생활 속의 문제를 발견하고 해결하고자 하는 기본적인 노력을 마인드맵 프로그램으로 적절히 표현함. 맵의 디자인 표현이 잘 되어있고 토픽이 안정감 있게 배치됨.","","","",null,"질문의 핵심 내용을 분명하게 알고 자신있는 답변을 정확하게 하였으며, 단원에 대한 기본적인 학습활동이 잘 되어있어 용어의 이해와 개념 파악이 우수함. 수업활동에 관심을 가지고 학습활동지를 수업과 연계하여 적절히 작성하였으며 교사의 질문에 대한 핵심 내용을 잘 파악하여 적절한 답변을 할 수 있는 학습 능력을 발휘함. 구상된 아이디어를 알기 쉽게 표현하는 알마인드맵 프로그램의 기본적인 사용을 할 수 있음. 생활 속의 문제를 발견하고 해결하고자 하는 기본적인 노력을 마인드맵 프로그램으로 적절히 표현함. 맵의 디자인 표현이 잘 되어있고 토픽이 안정감 있게 배치됨.",314]
[null,null,5,{"$f":"IF(설정!D9=\"\",\"\",설정!D9)","v":"학생 5"},"B","A","A","A",{"$nulls":6},"질문의 핵심 내용을 어느정도 알고 답변을 알맞게 잘 하였으며,","단원에 대한 기본적인 학습활동이 잘 되어있어 용어의 이해와 개념 파악이 우수함.","수업활동에 적극적인 태도를 가지고 학습활동지를 수업과 연계하여 충실히 작성함으로써 교사의 질문에 대한 핵심 내용을 잘 파악하여 정확한 답변을 할 수 있는 학습 능력을 발휘함.","아이디어를 시각적으로 디자인하여 알기 쉽게 표현하는 알마인드맵 프로그램의 고급 기능에 익숙하여 사용을 매우 잘 함. 생활 속의 문제를 발견하고 해결하고자 하는 구체적인 노력을 마인드맵 프로그램으로 매우 잘 표현할 수 있음. 토픽과 서브토픽 내용의 상호 관련성이 매우 적절하며 디자인 요소의 표현이 잘 되어있고 안정감 있게 배치함으로써 전체 맵의 이해도를 높였음.","","","",null,"질문의 핵심 내용을 어느정도 알고 답변을 알맞게 잘 하였으며, 단원에 대한 기본적인 학습활동이 잘 되어있어 용어의 이해와 개념 파악이 우수함. 수업활동에 적극적인 태도를 가지고 학습활동지를 수업과 연계하여 충실히 작성함으로써 교사의 질문에 대한 핵심 내용을 잘 파악하여 정확한 답변을 할 수 있는 학습 능력을 발휘함. 아이디어를 시각적으로 디자인하여 알기 쉽게 표현하는 알마인드맵 프로그램의 고급 기능에 익숙하여 사용을 매우 잘 함. 생활 속의 문제를 발견하고 해결하고자 하는 구체적인 노력을 마인드맵 프로그램으로 매우 잘 표현할 수 있음. 토픽과 서브토픽 내용의 상호 관련성이 매우 적절하며 디자인 요소의 표현이 잘 되어있고 안정감 있게 배치함으로써 전체 맵의 이해도를 높였음.",380]
[null,null,6,{"$f":"IF(설정!D10=\"\",\"\",설정!D10)","v":"학생 6"},"C","A","B","B",{"$nulls":6},"질문의 핵심 내용에 대한 이해가 부족하여 답변의 내용이 부실하였으며,","단원에 대한 기본적인 학습활동이 잘 되어있어 용어의 이해와 개념 파악이 우수함.","수업활동에 관심을 가지고 학습활동지를 수업과 연계하여 적절히 작성하였으며 교사의 질문에 대한 핵심 내용을 잘 파악하여 적절한 답변을 할 수 있는 학습 능력을 발휘함.","시각적으로 아이디어를 디자인하여 알기 쉽게 표현하는 알마인드맵 프로그램의 기본적인 기능을 활용 할 수 있음. 생활 속의 문제를 발견하고 해결하고자 하는 일반적인 노력을 마인드맵 프로그램으로 알맞게 표현함. 토픽과 서브토픽의 디자인 표현이 대체로 잘 되어있고 안정감 있게 배치되었음.","","","",null,"질문의 핵심 내용에 대한 이해가 부족하여 답변의 내용이 부실하였으며, 단원에 대한 기본적인 학습활동이 잘 되어있어 용어의 이해와 개념 파악이 우수함. 수업활동에 관심을 가지고 학습활동지를 수업과 연계하여 적절히 작성하였으며 교사의 질문에 대한 핵심 내용을 잘 파악하여 적절한 답변을 할 수 있는 학습 능력을 발휘함. 시각적으로 아이디어를 디자인하여 알기 쉽게 표현하는 알마인드맵 프로그램의 기본적인 기능을 활용 할 수 있음. 생활 속의 문제를 발견하고 해결하고자 하는 일반적인 노력을 마인드맵 프로그램으로 알맞게 표현함. 토픽과 서브토픽의 디자인 표현이 대체로 잘 되어있고 안정감 있게 배치되었음.",334]
[null,null,7,{"$f":"IF(설정!D11=\"\",\"\",설정!D11)","v":"학생 7"},"A","B","B","C",{"$nulls":6},"질문의 핵심 내용을 분명하게 알고 자신있는 답변을 정확하게 하였으며,","단원에 대한 기본적인 학습활동이 다소 부족하나 일반적인 용어의 개념파악이 양호함.","수업활동에 관심을 가지고 학습활동지를 수업과 연계하여 적절히 작성하였으며 교사의 질문에 대한 핵심 내용을 잘 파악하여 적절한 답변을 할 수 있는 학습 능력을 발휘함.","구상된 아이디어를 알기 쉽게 표현하는 알마인드맵 프로그램의 기본적인 사용을 할 수 있음. 생활 속의 문제를 발견하고 해결하고자 하는 기본적인 노력을 마인드맵 프로그램으로 적절히 표현함. 맵의 디자인 표현이 잘 되어있고 토픽이 안정감 있게 배치됨.","","","",null,"질문의 핵심 내용을 분명하게 알고 자신있는 답변을 정확하게 하였으며, 단원에 대한 기본적인 학습활동이 다소 부족하나 일반적인 용어의 개념파악이 양호함. 수업활동에 관심을 가지고 학습활동지를 수업과 연계하여 적절히 작성하였으며 교사의 질문에 대한 핵심 내용을 잘 파악하여 적절한 답변을 할 수 있는 학습 능력을 발휘함. 구상된 아이디어를 알기 쉽게 표현하는 알마인드맵 프로그램의 기본적인 사용을 할 수 있음. 생활 속의 문제를 발견하고 해결하고자 하는 기본적인 노력을 마인드맵 프로그램으로 적절히 표현함. 맵의 디자인 표현이 잘 되어있고 토픽이 안정감 있게 배치됨.",315]
[null,null,8,{"$f":"IF(설정!D12=\"\",\"\",설정!D12)","v":"학생 8"},"B","A","C","A",{"$nulls":6},"질문의 핵심 내용을 어느정도 알고 답변을 알맞게 잘 하였으며,","단원에 대한 기본적인 학습활동이 잘 되어있어 용어의 이해와 개념 파악이 우수함.","수업활동에 기본적인 태도를 가지고 학습활동지를 적절히 작성하였으며 교사의 질문에 대한 내용을 어느정도 파악하여 일부분 답변을 할 수 있는 학습 능력을 발휘함.","아이디어를 시각적으로 디자인하여 알기 쉽게 표현하는 알마인드맵 프로그램의 고급 기능에 익숙하여 사용을 매우 잘 함. 생활 속의 문제를 발견하고 해결하고자 하는 구체적인 노력을 마인드맵 프로그램으로 매우 잘 표현할 수 있음. 토픽과 서브토픽 내용의 상호 관련성이 매우 적절하며 디자인 요소의 표현이 잘 되어있고 안정감 있게 배치함으로써 전체 맵의 이해도를 높였음.","","","",null,"질문의 핵심 내용을 어느정도 알고 답변을 알맞게 잘 하였으며, 단원에 대한 기본적인 학습활동이 잘 되어있어 용어의 이해와 개념 파악이 우수함. 수업활동에 기본적인 태도를 가지고 학습활동지를 적절히 작성하였으며 교사의 질문에 대한 내용을 어느정도 파악하여 일부분 답변을 할 수 있는 학습 능력을 발휘함. 아이디어를 시각적으로 디자인하여 알기 쉽게 표현하는 알마인드맵 프로그램의 고급 기능에 익숙하여 사용을 매우 잘 함. 생활 속의 문제를 발견하고 해결하고자 하는 구체적인 노력을 마인드맵 프로그램으로 매우 잘 표현할 수 있음. 토픽과 서브토픽 내용의 상호 관련성이 매우 적절하며 디자인 요소의 표현이 잘 되어있고 안정감 있게 배치함으로써 전체 맵의 이해도를 높였음.",371]
[null,null,9,{"$f":"IF(설정!D13=\"\",\"\",설정!D13)","v":"학생 9"},"A","B","A","C",{"$nulls":6},"질문의 핵심 내용을 분명하게 알고 자신있는 답변을 정확하게 하였으며,","단원에 대한 기본적인 학습활동이 다소 부족하나 일반적인 용어의 개념파악이 양호함.","수업활동에 적극적인 태도를 가지고 학습활동지를 수업과 연계하여 충실히 작성함으로써 교사의 질문에 대한 핵심 내용을 잘 파악하여 정확한 답변을 할 수 있는 학습 능력을 발휘함.","구상된 아이디어를 알기 쉽게 표현하는 알마인드맵 프로그램의 기본적인 사용을 할 수 있음. 생활 속의 문제를 발견하고 해결하고자 하는 기본적인 노력을 마인드맵 프로그램으로 적절히 표현함. 맵의 디자인 표현이 잘 되어있고 토픽이 안정감 있게 배치됨.","","","",null,"질문의 핵심 내용을 분명하게 알고 자신있는 답변을 정확하게 하였으며, 단원에 대한 기본적인 학습활동이 다소 부족하나 일반적인 용어의 개념파악이 양호함. 수업활동에 적극적인 태도를 가지고 학습활동지를 수업과 연계하여 충실히 작성함으로써 교사의 질문에 대한 핵심 내용을 잘 파악하여 정확한 답변을 할 수 있는 학습 능력을 발휘함. 구상된 아이디어를 알기 쉽게 표현하는 알마인드맵 프로그램의 기본적인 사용을 할 수 있음. 생활 속의 문제를 발견하고 해결하고자 하는 기본적인 노력을 마인드맵 프로그램으로 적절히 표현함. 맵의 디자인 표현이 잘 되어있고 토픽이 안정감 있게 배치됨.",320]
[null,null,10,{"$f":"IF(설정!D14=\"\",\"\",설정!D14)","v":"학생10"},"C","B","A","B",{"$nulls":6},"질문의 핵심 내용에 대한 이해가 부족하여 답변의 내용이 부실하였으며,","단원에 대한 기본적인 학습활동이 다소 부족하나 일반적인 용어의 개념파악이 양호함.","수업활동에 적극적인 태도를 가지고 학습활동지를 수업과 연계하여 충실히 작성함으로써 교사의 질문에 대한 핵심 내용을 잘 파악하여 정확한 답변을 할 수 있는 학습 능력을 발휘함.","시각적으로 아이디어를 디자인하여 알기 쉽게 표현하는 알마인드맵 프로그램의 기본적인 기능을 활용 할 수 있음. 생활 속의 문제를 발견하고 해결하고자 하는 일반적인 노력을 마인드맵 프로그램으로 알맞게 표현함. 토픽과 서브토픽의 디자인 표현이 대체로 잘 되어있고 안정감 있게 배치되었음.","","","",null,"질문의 핵심 내용에 대한 이해가 부족하여 답변의 내용이 부실하였으며, 단원에 대한 기본적인 학습활동이 다소 부족하나 일반적인 용어의 개념파악이 양호함. 수업활동에 적극적인 태도를 가지고 학습활동지를 수업과 연계하여 충실히 작성함으로써 교사의 질문에 대한 핵심 내용을 잘 파악하여 정확한 답변을 할 수 있는 학습 능력을 발휘함. 시각적으로 아이디어를 디자인하여 알기 쉽게 표현하는 알마인드맵 프로그램의 기본적인 기능을 활용 할 수 있음. 생활 속의 문제를 발견하고 해결하고자 하는 일반적인 노력을 마인드맵 프로그램으로 알맞게 표현함. 토픽과 서브토픽의 디자인 표현이 대체로 잘 되어있고 안정감 있게 배치되었음.",340]
[null,null,11,{"$f":"IF(설정!D15=\"\",\"\",설정!D15)","v":"학생11"},"B","A","B","C",{"$nulls":6},"질문의 핵심 내용을 어느정도 알고 답변을 알맞게 잘 하였으며,","단원에 대한 기본적인 학습활동이 잘 되어있어 용어의 이해와 개념 파악이 우수함.","수업활동에 관심을 가지고 학습활동지를 수업과 연계하여 적절히 작성하였으며 교사의 질문에 대한 핵심 내용을 잘 파악하여 적절한 답변을 할 수 있는 학습 능력을 발휘함.","구상된 아이디어를 알기 쉽게 표현하는 알마인드맵 프로그램의 기본적인 사용을 할 수 있음. 생활 속의 문제를 발견하고 해결하고자 하는 기본적인 노력을 마인드맵 프로그램으로 적절히 표현함. 맵의 디자인 표현이 잘 되어있고 토픽이 안정감 있게 배치됨.","","","",null,"질문의 핵심 내용을 어느정도 알고 답변을 알맞게 잘 하였으며, 단원에 대한 기본적인 학습활동이 잘 되어있어 용어의 이해와 개념 파악이 우수함. 수업활동에 관심을 가지고 학습활동지를 수업과 연계하여 적절히 작성하였으며 교사의 질문에 대한 핵심 내용을 잘 파악하여 적절한 답변을 할 수 있는 학습 능력을 발휘함. 구상된 아이디어를 알기 쉽게 표현하는 알마인드맵 프로그램의 기본적인 사용을 할 수 있음. 생활 속의 문제를 발견하고 해결하고자 하는 기본적인 노력을 마인드맵 프로그램으로 적절히 표현함. 맵의 디자인 표현이 잘 되어있고 토픽이 안정감 있게 배치됨.",310]
[null,null,12,{"$f":"IF(설정!D16=\"\",\"\",설정!D16)","v":"학생12"},"B","C","B","A",{"$nulls":6},"질문의 핵심 내용을 어느정도 알고 답변을 알맞게 잘 하였으며,","단원에 대한 기본 학습 활동이 부족하여 용어와 개념의 이해도가 낮음.","수업활동에 관심을 가지고 학습활동지를 수업과 연계하여 적절히 작성하였으며 교사의 질문에 대한 핵심 내용을 잘 파악하여 적절한 답변을 할 수 있는 학습 능력을 발휘함.","아이디어를 시각적으로 디자인하여 알기 쉽게 표현하는 알마인드맵 프로그램의 고급 기능에 익숙하여 사용을 매우 잘 함. 생활 속의 문제를 발견하고 해결하고자 하는 구체적인 노력을 마인드맵 프로그램으로 매우 잘 표현할 수 있음. 토픽과 서브토픽 내용의 상호 관련성이 매우 적절하며 디자인 요소의 표현이 잘 되어있고 안정감 있게 배치함으로써 전체 맵의 이해도를 높였음.","","","",null,"질문의 핵심 내용을 어느정도 알고 답변을 알맞게 잘 하였으며, 단원에 대한 기본 학습 활동이 부족하여 용어와 개념의 이해도가 낮음. 수업활동에 관심을 가지고 학습활동지를 수업과 연계하여 적절히 작성하였으며 교사의 질문에 대한 핵심 내용을 잘 파악하여 적절한 답변을 할 수 있는 학습 능력을 발휘함. 아이디어를 시각적으로 디자인하여 알기 쉽게 표현하는 알마인드맵 프로그램의 고급 기능에 익숙하여 사용을 매우 잘 함. 생활 속의 문제를 발견하고 해결하고자 하는 구체적인 노력을 마인드맵 프로그램으로 매우 잘 표현할 수 있음. 토픽과 서브토픽 내용의 상호 관련성이 매우 적절하며 디자인 요소의 표현이 잘 되어있고 안정감 있게 배치함으로써 전체 맵의 이해도를 높였음.",369]
[null,null,13,{"$f":"IF(설정!D17=\"\",\"\",설정!D17)","v":"학생13"},"C","C","C","B",{"$nulls":6},"질문의 핵심 내용에 대한 이해가 부족하여 답변의 내용이 부실하였으며,","단원에 대한 기본 학습 활동이 부족하여 용어와 개념의 이해도가 낮음.","수업활동에 기본적인 태도를 가지고 학습활동지를 적절히 작성하였으며 교사의 질문에 대한 내용을 어느정도 파악하여 일부분 답변을 할 수 있는 학습 능력을 발휘함.","시각적으로 아이디어를 디자인하여 알기 쉽게 표현하는 알마인드맵 프로그램의 기본적인 기능을 활용 할 수 있음. 생활 속의 문제를 발견하고 해결하고자 하는 일반적인 노력을 마인드맵 프로그램으로 알맞게 표현함. 토픽과 서브토픽의 디자인 표현이 대체로 잘 되어있고 안정감 있게 배치되었음.","","","",null,"질문의 핵심 내용에 대한 이해가 부족하여 답변의 내용이 부실하였으며, 단원에 대한 기본 학습 활동이 부족하여 용어와 개념의 이해도가 낮음. 수업활동에 기본적인 태도를 가지고 학습활동지를 적절히 작성하였으며 교사의 질문에 대한 내용을 어느정도 파악하여 일부분 답변을 할 수 있는 학습 능력을 발휘함. 시각적으로 아이디어를 디자인하여 알기 쉽게 표현하는 알마인드맵 프로그램의 기본적인 기능을 활용 할 수 있음. 생활 속의 문제를 발견하고 해결하고자 하는 일반적인 노력을 마인드맵 프로그램으로 알맞게 표현함. 토픽과 서브토픽의 디자인 표현이 대체로 잘 되어있고 안정감 있게 배치되었음.",324]
[null,null,14,{"$f":"IF(설정!D18=\"\",\"\",설정!D18)","v":"학생14"},"A","B","A","C",{"$nulls":6},"질문의 핵심 내용을 분명하게 알고 자신있는 답변을 정확하게 하였으며,","단원에 대한 기본적인 학습활동이 다소 부족하나 일반적인 용어의 개념파악이 양호함.","수업활동에 적극적인 태도를 가지고 학습활동지를 수업과 연계하여 충실히 작성함으로써 교사의 질문에 대한 핵심 내용을 잘 파악하여 정확한 답변을 할 수 있는 학습 능력을 발휘함.","구상된 아이디어를 알기 쉽게 표현하는 알마인드맵 프로그램의 기본적인 사용을 할 수 있음. 생활 속의 문제를 발견하고 해결하고자 하는 기본적인 노력을 마인드맵 프로그램으로 적절히 표현함. 맵의 디자인 표현이 잘 되어있고 토픽이 안정감 있게 배치됨.","","","",null,"질문의 핵심 내용을 분명하게 알고 자신있는 답변을 정확하게 하였으며, 단원에 대한 기본적인 학습활동이 다소 부족하나 일반적인 용어의 개념파악이 양호함. 수업활동에 적극적인 태도를 가지고 학습활동지를 수업과 연계하여 충실히 작성함으로써 교사의 질문에 대한 핵심 내용을 잘 파악하여 정확한 답변을 할 수 있는 학습 능력을 발휘함. 구상된 아이디어를 알기 쉽게 표현하는 알마인드맵 프로그램의 기본적인 사용을 할 수 있음. 생활 속의 문제를 발견하고 해결하고자 하는 기본적인 노력을 마인드맵 프로그램으로 적절히 표현함. 맵의 디자인 표현이 잘 되어있고 토픽이 안정감 있게 배치됨.",320]
[null,null,15,{"$f":"IF(설정!D19=\"\",\"\",설정!D19)","v":"학생15"},"A","A","C","B",{"$nulls":6},"질문의 핵심 내용을 분명하게 알고 자신있는 답변을 정확하게 하였으며,","단원에 대한 기본적인 학습활동이 잘 되어있어 용어의 이해와 개념 파악이 우수함.","수업활동에 기본적인 태도를 가지고 학습활동지를 적절히 작성하였으며 교사의 질문에 대한 내용을 어느정도 파악하여 일부분 답변을 할 수 있는 학습 능력을 발휘함.","시각적으로 아이디어를 디자인하여 알기 쉽게 표현하는 알마인드맵 프로그램의 기본적인 기능을 활용 할 수 있음. 생활 속의 문제를 발견하고 해결하고자 하는 일반적인 노력을 마인드맵 프로그램으로 알맞게 표현함. 토픽과 서브토픽의 디자인 표현이 대체로 잘 되어있고 안정감 있게 배치되었음.","","","",null,"질문의 핵심 내용을 분명하게 알고 자신있는 답변을 정확하게 하였으며, 단원에 대한 기본적인 학습활동이 잘 되어있어 용어의 이해와 개념 파악이 우수함. 수업활동에 기본적인 태도를 가지고 학습활동지를 적절히 작성하였으며 교사의 질문에 대한 내용을 어느정도 파악하여 일부분 답변을 할 수 있는 학습 능력을 발휘함. 시각적으로 아이디어를 디자인하여 알기 쉽게 표현하는 알마인드맵 프로그램의 기본적인 기능을 활용 할 수 있음. 생활 속의 문제를 발견하고 해결하고자 하는 일반적인 노력을 마인드맵 프로그램으로 알맞게 표현함. 토픽과 서브토픽의 디자인 표현이 대체로 잘 되어있고 안정감 있게 배치되었음.",330]
[null,null,16,{"$f":"IF(설정!D20=\"\",\"\",설정!D20)","v":"학생16"},"B","B","A","전출",{"$nulls":6},"질문의 핵심 내용을 어느정도 알고 답변을 알맞게 잘 하였으며,","단원에 대한 기본적인 학습활동이 다소 부족하나 일반적인 용어의 개념파악이 양호함.","수업활동에 적극적인 태도를 가지고 학습활동지를 수업과 연계하여 충실히 작성함으로써 교사의 질문에 대한 핵심 내용을 잘 파악하여 정확한 답변을 할 수 있는 학습 능력을 발휘함.","","","","",null,"질문의 핵심 내용을 어느정도 알고 답변을 알맞게 잘 하였으며, 단원에 대한 기본적인 학습활동이 다소 부족하나 일반적인 용어의 개념파악이 양호함. 수업활동에 적극적인 태도를 가지고 학습활동지를 수업과 연계하여 충실히 작성함으로써 교사의 질문에 대한 핵심 내용을 잘 파악하여 정확한 답변을 할 수 있는 학습 능력을 발휘함. ",179]
[null,null,17,{"$f":"IF(설정!D21=\"\",\"\",설정!D21)","v":"학생17"},"B","C","A","B",{"$nulls":6},"질문의 핵심 내용을 어느정도 알고 답변을 알맞게 잘 하였으며,","단원에 대한 기본 학습 활동이 부족하여 용어와 개념의 이해도가 낮음.","수업활동에 적극적인 태도를 가지고 학습활동지를 수업과 연계하여 충실히 작성함으로써 교사의 질문에 대한 핵심 내용을 잘 파악하여 정확한 답변을 할 수 있는 학습 능력을 발휘함.","시각적으로 아이디어를 디자인하여 알기 쉽게 표현하는 알마인드맵 프로그램의 기본적인 기능을 활용 할 수 있음. 생활 속의 문제를 발견하고 해결하고자 하는 일반적인 노력을 마인드맵 프로그램으로 알맞게 표현함. 토픽과 서브토픽의 디자인 표현이 대체로 잘 되어있고 안정감 있게 배치되었음.","","","",null,"질문의 핵심 내용을 어느정도 알고 답변을 알맞게 잘 하였으며, 단원에 대한 기본 학습 활동이 부족하여 용어와 개념의 이해도가 낮음. 수업활동에 적극적인 태도를 가지고 학습활동지를 수업과 연계하여 충실히 작성함으로써 교사의 질문에 대한 핵심 내용을 잘 파악하여 정확한 답변을 할 수 있는 학습 능력을 발휘함. 시각적으로 아이디어를 디자인하여 알기 쉽게 표현하는 알마인드맵 프로그램의 기본적인 기능을 활용 할 수 있음. 생활 속의 문제를 발견하고 해결하고자 하는 일반적인 노력을 마인드맵 프로그램으로 알맞게 표현함. 토픽과 서브토픽의 디자인 표현이 대체로 잘 되어있고 안정감 있게 배치되었음.",329]
[null,null,18,{"$f":"IF(설정!D22=\"\",\"\",설정!D22)","v":"학생18"},"A","A","B","A",{"$nulls":6},"질문의 핵심 내용을 분명하게 알고 자신있는 답변을 정확하게 하였으며,","단원에 대한 기본적인 학습활동이 잘 되어있어 용어의 이해와 개념 파악이 우수함.","수업활동에 관심을 가지고 학습활동지를 수업과 연계하여 적절히 작성하였으며 교사의 질문에 대한 핵심 내용을 잘 파악하여 적절한 답변을 할 수 있는 학습 능력을 발휘함.","아이디어를 시각적으로 디자인하여 알기 쉽게 표현하는 알마인드맵 프로그램의 고급 기능에 익숙하여 사용을 매우 잘 함. 생활 속의 문제를 발견하고 해결하고자 하는 구체적인 노력을 마인드맵 프로그램으로 매우 잘 표현할 수 있음. 토픽과 서브토픽 내용의 상호 관련성이 매우 적절하며 디자인 요소의 표현이 잘 되어있고 안정감 있게 배치함으로써 전체 맵의 이해도를 높였음.","","","",null,"질문의 핵심 내용을 분명하게 알고 자신있는 답변을 정확하게 하였으며, 단원에 대한 기본적인 학습활동이 잘 되어있어 용어의 이해와 개념 파악이 우수함. 수업활동에 관심을 가지고 학습활동지를 수업과 연계하여 적절히 작성하였으며 교사의 질문에 대한 핵심 내용을 잘 파악하여 적절한 답변을 할 수 있는 학습 능력을 발휘함. 아이디어를 시각적으로 디자인하여 알기 쉽게 표현하는 알마인드맵 프로그램의 고급 기능에 익숙하여 사용을 매우 잘 함. 생활 속의 문제를 발견하고 해결하고자 하는 구체적인 노력을 마인드맵 프로그램으로 매우 잘 표현할 수 있음. 토픽과 서브토픽 내용의 상호 관련성이 매우 적절하며 디자인 요소의 표현이 잘 되어있고 안정감 있게 배치함으로써 전체 맵의 이해도를 높였음.",379]
[null,null,19,{"$f":"IF(설정!D23=\"\",\"\",설정!D23)","v":"학생19"},"A","B","C","C",{"$nulls":6},"질문의 핵심 내용을 분명하게 알고 자신있는 답변을 정확하게 하였으며,","단원에 대한 기본적인 학습활동이 다소 부족하나 일반적인 용어의 개념파악이 양호함.","수업활동에 기본적인 태도를 가지고 학습활동지를 적절히 작성하였으며 교사의 질문에 대한 내용을 어느정도 파악하여 일부분 답변을 할 수 있는 학습 능력을 발휘함.","구상된 아이디어를 알기 쉽게 표현하는 알마인드맵 프로그램의 기본적인 사용을 할 수 있음. 생활 속의 문제를 발견하고 해결하고자 하는 기본적인 노력을 마인드맵 프로그램으로 적절히 표현함. 맵의 디자인 표현이 잘 되어있고 토픽이 안정감 있게 배치됨.","","","",null,"질문의 핵심 내용을 분명하게 알고 자신있는 답변을 정확하게 하였으며, 단원에 대한 기본적인 학습활동이 다소 부족하나 일반적인 용어의 개념파악이 양호함. 수업활동에 기본적인 태도를 가지고 학습활동지를 적절히 작성하였으며 교사의 질문에 대한 내용을 어느정도 파악하여 일부분 답변을 할 수 있는 학습 능력을 발휘함. 구상된 아이디어를 알기 쉽게 표현하는 알마인드맵 프로그램의 기본적인 사용을 할 수 있음. 생활 속의 문제를 발견하고 해결하고자 하는 기본적인 노력을 마인드맵 프로그램으로 적절히 표현함. 맵의 디자인 표현이 잘 되어있고 토픽이 안정감 있게 배치됨.",311]
[null,null,20,{"$f":"IF(설정!D24=\"\",\"\",설정!D24)","v":"학생20"},"B","B","A","A",{"$nulls":6},"질문의 핵심 내용을 어느정도 알고 답변을 알맞게 잘 하였으며,","단원에 대한 기본적인 학습활동이 다소 부족하나 일반적인 용어의 개념파악이 양호함.","수업활동에 적극적인 태도를 가지고 학습활동지를 수업과 연계하여 충실히 작성함으로써 교사의 질문에 대한 핵심 내용을 잘 파악하여 정확한 답변을 할 수 있는 학습 능력을 발휘함.","아이디어를 시각적으로 디자인하여 알기 쉽게 표현하는 알마인드맵 프로그램의 고급 기능에 익숙하여 사용을 매우 잘 함. 생활 속의 문제를 발견하고 해결하고자 하는 구체적인 노력을 마인드맵 프로그램으로 매우 잘 표현할 수 있음. 토픽과 서브토픽 내용의 상호 관련성이 매우 적절하며 디자인 요소의 표현이 잘 되어있고 안정감 있게 배치함으로써 전체 맵의 이해도를 높였음.","","","",null,"질문의 핵심 내용을 어느정도 알고 답변을 알맞게 잘 하였으며, 단원에 대한 기본적인 학습활동이 다소 부족하나 일반적인 용어의 개념파악이 양호함. 수업활동에 적극적인 태도를 가지고 학습활동지를 수업과 연계하여 충실히 작성함으로써 교사의 질문에 대한 핵심 내용을 잘 파악하여 정확한 답변을 할 수 있는 학습 능력을 발휘함. 아이디어를 시각적으로 디자인하여 알기 쉽게 표현하는 알마인드맵 프로그램의 고급 기능에 익숙하여 사용을 매우 잘 함. 생활 속의 문제를 발견하고 해결하고자 하는 구체적인 노력을 마인드맵 프로그램으로 매우 잘 표현할 수 있음. 토픽과 서브토픽 내용의 상호 관련성이 매우 적절하며 디자인 요소의 표현이 잘 되어있고 안정감 있게 배치함으로써 전체 맵의 이해도를 높였음.",381]
[null,null,21,{"$f":"IF(설정!D25=\"\",\"\",설정!D25)","v":"학생21"},"A","A","B","A",{"$nulls":6},"질문의 핵심 내용을 분명하게 알고 자신있는 답변을 정확하게 하였으며,","단원에 대한 기본적인 학습활동이 잘 되어있어 용어의 이해와 개념 파악이 우수함.","수업활동에 관심을 가지고 학습활동지를 수업과 연계하여 적절히 작성하였으며 교사의 질문에 대한 핵심 내용을 잘 파악하여 적절한 답변을 할 수 있는 학습 능력을 발휘함.","아이디어를 시각적으로 디자인하여 알기 쉽게 표현하는 알마인드맵 프로그램의 고급 기능에 익숙하여 사용을 매우 잘 함. 생활 속의 문제를 발견하고 해결하고자 하는 구체적인 노력을 마인드맵 프로그램으로 매우 잘 표현할 수 있음. 토픽과 서브토픽 내용의 상호 관련성이 매우 적절하며 디자인 요소의 표현이 잘 되어있고 안정감 있게 배치함으로써 전체 맵의 이해도를 높였음.","","","",null,"질문의 핵심 내용을 분명하게 알고 자신있는 답변을 정확하게 하였으며, 단원에 대한 기본적인 학습활동이 잘 되어있어 용어의 이해와 개념 파악이 우수함. 수업활동에 관심을 가지고 학습활동지를 수업과 연계하여 적절히 작성하였으며 교사의 질문에 대한 핵심 내용을 잘 파악하여 적절한 답변을 할 수 있는 학습 능력을 발휘함. 아이디어를 시각적으로 디자인하여 알기 쉽게 표현하는 알마인드맵 프로그램의 고급 기능에 익숙하여 사용을 매우 잘 함. 생활 속의 문제를 발견하고 해결하고자 하는 구체적인 노력을 마인드맵 프로그램으로 매우 잘 표현할 수 있음. 토픽과 서브토픽 내용의 상호 관련성이 매우 적절하며 디자인 요소의 표현이 잘 되어있고 안정감 있게 배치함으로써 전체 맵의 이해도를 높였음.",379]
[null,null,22,{"$f":"IF(설정!D26=\"\",\"\",설정!D26)","v":"학생22"},"B","A","C","B",{"$nulls":6},"질문의 핵심 내용을 어느정도 알고 답변을 알맞게 잘 하였으며,","단원에 대한 기본적인 학습활동이 잘 되어있어 용어의 이해와 개념 파악이 우수함.","수업활동에 기본적인 태도를 가지고 학습활동지를 적절히 작성하였으며 교사의 질문에 대한 내용을 어느정도 파악하여 일부분 답변을 할 수 있는 학습 능력을 발휘함.","시각적으로 아이디어를 디자인하여 알기 쉽게 표현하는 알마인드맵 프로그램의 기본적인 기능을 활용 할 수 있음. 생활 속의 문제를 발견하고 해결하고자 하는 일반적인 노력을 마인드맵 프로그램으로 알맞게 표현함. 토픽과 서브토픽의 디자인 표현이 대체로 잘 되어있고 안정감 있게 배치되었음.","","","",null,"질문의 핵심 내용을 어느정도 알고 답변을 알맞게 잘 하였으며, 단원에 대한 기본적인 학습활동이 잘 되어있어 용어의 이해와 개념 파악이 우수함. 수업활동에 기본적인 태도를 가지고 학습활동지를 적절히 작성하였으며 교사의 질문에 대한 내용을 어느정도 파악하여 일부분 답변을 할 수 있는 학습 능력을 발휘함. 시각적으로 아이디어를 디자인하여 알기 쉽게 표현하는 알마인드맵 프로그램의 기본적인 기능을 활용 할 수 있음. 생활 속의 문제를 발견하고 해결하고자 하는 일반적인 노력을 마인드맵 프로그램으로 알맞게 표현함. 토픽과 서브토픽의 디자인 표현이 대체로 잘 되어있고 안정감 있게 배치되었음.",326]
[null,null,23,{"$f":"IF(설정!D27=\"\",\"\",설정!D27)","v":"학생23"},"A","A","A","B",{"$nulls":6},"질문의 핵심 내용을 분명하게 알고 자신있는 답변을 정확하게 하였으며,","단원에 대한 기본적인 학습활동이 잘 되어있어 용어의 이해와 개념 파악이 우수함.","수업활동에 적극적인 태도를 가지고 학습활동지를 수업과 연계하여 충실히 작성함으로써 교사의 질문에 대한 핵심 내용을 잘 파악하여 정확한 답변을 할 수 있는 학습 능력을 발휘함.","시각적으로 아이디어를 디자인하여 알기 쉽게 표현하는 알마인드맵 프로그램의 기본적인 기능을 활용 할 수 있음. 생활 속의 문제를 발견하고 해결하고자 하는 일반적인 노력을 마인드맵 프로그램으로 알맞게 표현함. 토픽과 서브토픽의 디자인 표현이 대체로 잘 되어있고 안정감 있게 배치되었음.","","","",null,"질문의 핵심 내용을 분명하게 알고 자신있는 답변을 정확하게 하였으며, 단원에 대한 기본적인 학습활동이 잘 되어있어 용어의 이해와 개념 파악이 우수함. 수업활동에 적극적인 태도를 가지고 학습활동지를 수업과 연계하여 충실히 작성함으로써 교사의 질문에 대한 핵심 내용을 잘 파악하여 정확한 답변을 할 수 있는 학습 능력을 발휘함. 시각적으로 아이디어를 디자인하여 알기 쉽게 표현하는 알마인드맵 프로그램의 기본적인 기능을 활용 할 수 있음. 생활 속의 문제를 발견하고 해결하고자 하는 일반적인 노력을 마인드맵 프로그램으로 알맞게 표현함. 토픽과 서브토픽의 디자인 표현이 대체로 잘 되어있고 안정감 있게 배치되었음.",339]
[null,null,24,{"$f":"IF(설정!D28=\"\",\"\",설정!D28)","v":"학생24"},"A","A","A","A",{"$nulls":6},"질문의 핵심 내용을 분명하게 알고 자신있는 답변을 정확하게 하였으며,","단원에 대한 기본적인 학습활동이 잘 되어있어 용어의 이해와 개념 파악이 우수함.","수업활동에 적극적인 태도를 가지고 학습활동지를 수업과 연계하여 충실히 작성함으로써 교사의 질문에 대한 핵심 내용을 잘 파악하여 정확한 답변을 할 수 있는 학습 능력을 발휘함.","아이디어를 시각적으로 디자인하여 알기 쉽게 표현하는 알마인드맵 프로그램의 고급 기능에 익숙하여 사용을 매우 잘 함. 생활 속의 문제를 발견하고 해결하고자 하는 구체적인 노력을 마인드맵 프로그램으로 매우 잘 표현할 수 있음. 토픽과 서브토픽 내용의 상호 관련성이 매우 적절하며 디자인 요소의 표현이 잘 되어있고 안정감 있게 배치함으로써 전체 맵의 이해도를 높였음.","","","",null,"질문의 핵심 내용을 분명하게 알고 자신있는 답변을 정확하게 하였으며, 단원에 대한 기본적인 학습활동이 잘 되어있어 용어의 이해와 개념 파악이 우수함. 수업활동에 적극적인 태도를 가지고 학습활동지를 수업과 연계하여 충실히 작성함으로써 교사의 질문에 대한 핵심 내용을 잘 파악하여 정확한 답변을 할 수 있는 학습 능력을 발휘함. 아이디어를 시각적으로 디자인하여 알기 쉽게 표현하는 알마인드맵 프로그램의 고급 기능에 익숙하여 사용을 매우 잘 함. 생활 속의 문제를 발견하고 해결하고자 하는 구체적인 노력을 마인드맵 프로그램으로 매우 잘 표현할 수 있음. 토픽과 서브토픽 내용의 상호 관련성이 매우 적절하며 디자인 요소의 표현이 잘 되어있고 안정감 있게 배치함으로써 전체 맵의 이해도를 높였음.",384]
[null,null,25,{"$f":"IF(설정!D29=\"\",\"\",설정!D29)","v":"학생25"},"전입","B","C","B",{"$nulls":6},"","단원에 대한 기본적인 학습활동이 다소 부족하나 일반적인 용어의 개념파악이 양호함.","수업활동에 기본적인 태도를 가지고 학습활동지를 적절히 작성하였으며 교사의 질문에 대한 내용을 어느정도 파악하여 일부분 답변을 할 수 있는 학습 능력을 발휘함.","시각적으로 아이디어를 디자인하여 알기 쉽게 표현하는 알마인드맵 프로그램의 기본적인 기능을 활용 할 수 있음. 생활 속의 문제를 발견하고 해결하고자 하는 일반적인 노력을 마인드맵 프로그램으로 알맞게 표현함. 토픽과 서브토픽의 디자인 표현이 대체로 잘 되어있고 안정감 있게 배치되었음.","","","",null," 단원에 대한 기본적인 학습활동이 다소 부족하나 일반적인 용어의 개념파악이 양호함. 수업활동에 기본적인 태도를 가지고 학습활동지를 적절히 작성하였으며 교사의 질문에 대한 내용을 어느정도 파악하여 일부분 답변을 할 수 있는 학습 능력을 발휘함. 시각적으로 아이디어를 디자인하여 알기 쉽게 표현하는 알마인드맵 프로그램의 기본적인 기능을 활용 할 수 있음. 생활 속의 문제를 발견하고 해결하고자 하는 일반적인 노력을 마인드맵 프로그램으로 알맞게 표현함. 토픽과 서브토픽의 디자인 표현이 대체로 잘 되어있고 안정감 있게 배치되었음.",293]
[null,null,26,{"$f":"IF(설정!D30=\"\",\"\",설정!D30)","v":""},{"$nulls":10},"","","","","","","",null,"",0]
[null,null,27,{"$f":"IF(설정!D31=\"\",\"\",설정!D31)","v":""},{"$nulls":10},"","","","","","","",null,"",0]
[null,null,28,{"$f":"IF(설정!D32=\"\",\"\",설정!D32)","v":""},{"$nulls":10},"","","","","","","",null,"",0]
[null,null,29,{"$f":"IF(설정!D33=\"\",\"\",설정!D33)","v":""},{"$nulls":10},"","","","","","","",null,"",0]
[null,null,30,{"$f":"IF(설정!D34=\"\",\"\",설정!D34)","v":""},{"$nulls":10},"","","","","","","",null,"",0]
[null,null,31,{"$f":"IF(설정!D35=\"\",\"\",설정!D35)","v":""},{"$nulls":10},"","","","","","","",null,"",0]
[null,null,32,{"$f":"IF(설정!D36=\"\",\"\",설정!D36)","v":""},{"$nulls":10},"","","","","","","",null,"",0]
[null,null,33,{"$f":"IF(설정!D37=\"\",\"\",설정!D37)","v":""},{"$nulls":10},"","","","","","","",null,"",0]
[null,null,34,{"$f":"IF(설정!D38=\"\",\"\",설정!D38)","v":""},{"$nulls":10},"","","","","","","",null,"",0]
[null,null,35,{"$f":"IF(설정!D39=\"\",\"\",설정!D39)","v":""},{"$nulls":10},"","","","","","","",null,"",0]
[null,null,36,{"$f":"IF(설정!D40=\"\",\"\",설정!D40)","v":""},{"$nulls":10},"","","","","","","",null,"",0]
[null,null,37,{"$f":"IF(설정!D41=\"\",\"\",설정!D41)","v":""},{"$nulls":10},"","","","","","","",null,"",0]
[null,null,38,{"$f":"IF(설정!D42=\"\",\"\",설정!D42)","v":""},{"$nulls":10},"","","","","","","",null,"",0]
[null,null,39,{"$f":"IF(설정!D43=\"\",\"\",설정!D43)","v":""},{"$nulls":10},"","","","","","","",null,"",0]
[null,null,40,{"$f":"IF(설정!D44=\"\",\"\",설정!D44)","v":""},{"$nulls":10},"","","","","","","",null,"",0]
[{"$nulls":11},{"$f":"메인!D4&\"학업성적관리위원회\"","v":"충남중학교학업성적관리위원회"}]

{"sheet":"자유1","index":10,"n_rows":12,"n_cols":5,"rows_kept":12,"merged":[[1,2,1,4],[2,2,2,4],[4,4,5,4]]}
[]
[null,null,{"$f":"\"자유학기 과정 중심 평가 결과 서술 내용 (\"&메인!H8&\") - 1\"","v":"자유학기 과정 중심 평가 결과 서술 내용 (주제선택 활동) - 1"}]
[null,null,"( 등급을 판정하는 기준이 아니라, 평가 결과로서 학교생활기록부에 특기사항으로 기록될 등급별 내용 입니다. )"]
[]
[null,null,"평가 주제",{"$f":"IF(메인!J8>=1,메인!F18,\"\")","v":"재료의 가공"},"글자 수\n\n(참고)"]
[null,null,"평가 내용",{"$f":"IF(메인!J8>=1,메인!H18,\"\")","v":"각종 재료(종이, 우드락, 목재 등)를 원하는 치수와 모양대로 공구를 이용하여 가공할 수 있음"}]
[null,null,"A","안전 수칙을 준수하며 도구를 이용한 각종 재료(하드보드지, 우드락, 폼보드, 목재)의 자르기를 원하는 치수와 모양대로 안정감 있게 잘 하였음.",{"$f":"IF(D7=\"\",\"\",LEN(D7))","v":79}]
[null,null,"B","안전 수칙을 준수하였으나 도구를 이용한 각종 재료(하드보드지, 우드락, 폼보드, 목재)의 자르기에서 일부 재료는 원하는 치수와 모양대로 처리함이 다소 부족하였음.",{"$f":"IF(D8=\"\",\"\",LEN(D8))","v":90}]
[null,null,"C","안전 수칙이 잘 지켜지지 않고 도구를 이용한 각종 재료(하드보드지, 우드락, 폼보드, 목재)의 자르기를 원하는 치수와 모양대로 하는데 어려움을 겪었음.",{"$f":"IF(D9=\"\",\"\",LEN(D9))","v":84}]
[null,null,"D",null,{"$f":"IF(D10=\"\",\"\",LEN(D10))","v":""}]
[null,null,"E",null,{"$f":"IF(D11=\"\",\"\",LEN(D11))","v":""}]
[{"$nulls":4},{"$f":"메인!D4&\"학업성적관리위원회\"","v":"충남중학교학업성적관리위원회"}]

{"sheet":"자유2","index":11,"n_rows":12,"n_cols":5,"rows_kept":12,"merged":[[1,2,1,4],[2,2,2,4],[4,4,5,4]]}
[]
[null,null,{"$f":"\"자유학기 과정 중심 평가 결과 서술 내용 (\"&메인!H8&\") - 2\"","v":"자유학기 과정 중심 평가 결과 서술 내용 (주제선택 활동) - 2"}]
[null,null,"( 등급을 판정하는 기준이 아니라, 평가 결과로서 학교생활기록부에 특기사항으로 기록될 등급별 내용 입니다. )"]
[]
[null,null,"평가 주제",{"$f":"IF(메인!J8>=2,메인!F19,\"\")","v":"전통 한옥 목재 맞춤 제작"},"글자 수\n\n(참고)"]
[null,null,"평가 내용",{"$f":"IF(메인!J8>=2,메인!H19,\"\")","v":"부품의 정확한 가공 및 다듬기 상태, 부품 간 끼워 맞춤 상태와 접합의 견고함"}]
[null,null,"A","한옥의 짜맞춤 구조물 만들기에서 부품의 제작이 정확하고 조립이 견고하여 완성도가 높음.",{"$f":"IF(D7=\"\",\"\",LEN(D7))","v":48}]
[null,null,"B","한옥의 짜맞춤 구조물 부품의 제작과 조립이 양호하여 일반적인 작품으로서의 완성을 하였음.",{"$f":"IF(D8=\"\",\"\",LEN(D8))","v":49}]
[null,null,"C","한옥의 짜맞춤 구조물 만들기 과정에 대한 부품 제작 및 조립 기능이 부족하여 완성도가 낮음.",{"$f":"IF(D9=\"\",\"\",LEN(D9))","v":51}]
[null,null,"D",null,{"$f":"IF(D10=\"\",\"\",LEN(D10))","v":""}]
[null,null,"E",null,{"$f":"IF(D11=\"\",\"\",LEN(D11))","v":""}]
[{"$nulls":4},{"$f":"메인!D4&\"학업성적관리위원회\"","v":"충남중학교학업성적관리위원회"}]

{"sheet":"자유3","index":12,"n_rows":12,"n_cols":5,"rows_kept":12,"merged":[[1,2,1,4],[2,2,2,4],[4,4,5,4]]}
[]
[null,null,{"$f":"\"자유학기 과정 중심 평가 결과 서술 내용 (\"&메인!H8&\") - 3\"","v":"자유학기 과정 중심 평가 결과 서술 내용 (주제선택 활동) - 3"}]
[null,null,"( 등급을 판정하는 기준이 아니라, 평가 결과로서 학교생활기록부에 특기사항으로 기록될 등급별 내용 입니다. )"]
[]
[null,null,"평가 주제",{"$f":"IF(메인!J8>=3,메인!F20,\"\")","v":"창의적 계단 모형 만들기"},"글자 수\n\n(참고)"]
[null,null,"평가 내용",{"$f":"IF(메인!J8>=3,메인!H20,\"\")","v":"부품의 정확한 가공 및 다듬기 상태, 접착제를 이용한 부품의 조립과 연결 상태, 입체 공간에서의 창의적인 계단 구조와 기능"}]
[null,null,"A","실내외 통로 구조물로서 입체적인 계단의 구성 및 벽면과의 배치가 매우 잘 되었음.",{"$f":"IF(D7=\"\",\"\",LEN(D7))","v":45}]
[null,null,"B","실내외 통로 구조물로서 단순한 계단의 구성 및 벽면과의 배치가 양호한 편임.",{"$f":"IF(D8=\"\",\"\",LEN(D8))","v":42}]
[null,null,"C","실내외 통로 구조물로서 계단의 구성 및 벽면과의 배치가 잘 이루어지지 않았음.",{"$f":"IF(D9=\"\",\"\",LEN(D9))","v":43}]
[null,null,"D",null,{"$f":"IF(D10=\"\",\"\",LEN(D10))","v":""}]
[null,null,"E",null,{"$f":"IF(D11=\"\",\"\",LEN(D11))","v":""}]
[{"$nulls":4},{"$f":"메인!D4&\"학업성적관리위원회\"","v":"충남중학교학업성적관리위원회"}]

{"sheet":"자유4","index":13,"n_rows":12,"n_cols":5,"rows_kept":12,"merged":[[1,2,1,4],[2,2,2,4],[4,4,5,4]]}
[]
[null,null,{"$f":"\"자유학기 과정 중심 평가 결과 서술 내용 (\"&메인!H8&\") - 4\"","v":"자유학기 과정 중심 평가 결과 서술 내용 (주제선택 활동) - 4"}]
[null,null,"( 등급을 판정하는 기준이 아니라, 평가 결과로서 학교생활기록부에 특기사항으로 기록될 등급별 내용 입니다. )"]
[]
[null,null,"평가 주제",{"$f":"IF(메인!J8>=4,메인!F21,\"\")","v":"창의적 모형주택 만들기"},"글자 수\n\n(참고)"]
[null,null,"평가 내용",{"$f":"IF(메인!J8>=4,메인!H21,\"\")","v":"태양광 이용의 친환경 주택 및 전통 한옥 구조물 이해를 위한 조립형 키트 방식 한옥 제작 후 창의적으로 꾸미기"}]
[null,null,"A","4인 가족의 주거공간 구상과 설계가 잘된 상태에서 주어진 재료를 이용한 부품 가공과 조립 및 꾸미기로 모형주택을 잘 만들었음.",{"$f":"IF(D7=\"\",\"\",LEN(D7))","v":70}]
[null,null,"B","4인 가족의 주거공간 구상과 설계가 평범한 상태에서 주어진 재료를 이용한 주택 구상과 설계는 다소 미흡하나 가공 및 조립과 꾸미기로 모형주택을 적당하게 만들었음.",{"$f":"IF(D8=\"\",\"\",LEN(D8))","v":90}]
[null,null,"C","4인 가족의 주거공간 구상과 설계가 부족한 상태에서 주어진 재료를 이용한 주택 구상과 설계가 미흡하고 부품 가공과 조립 및 꾸미기 작업이 대체로 서툴렀음.",{"$f":"IF(D9=\"\",\"\",LEN(D9))","v":86}]
[null,null,"D",null,{"$f":"IF(D10=\"\",\"\",LEN(D10))","v":""}]
[null,null,"E",null,{"$f":"IF(D11=\"\",\"\",LEN(D11))","v":""}]
[{"$nulls":4},{"$f":"메인!D4&\"학업성적관리위원회\"","v":"충남중학교학업성적관리위원회"}]

{"sheet":"자유5","index":14,"n_rows":12,"n_cols":5,"rows_kept":12,"merged":[[1,2,1,4],[2,2,2,4],[4,4,5,4]]}
[]
[null,null,{"$f":"\"자유학기 과정 중심 평가 결과 서술 내용 (\"&메인!H8&\") - 5\"","v":"자유학기 과정 중심 평가 결과 서술 내용 (주제선택 활동) - 5"}]
[null,null,"( 등급을 판정하는 기준이 아니라, 평가 결과로서 학교생활기록부에 특기사항으로 기록될 등급별 내용 입니다. )"]
[]
[null,null,"평가 주제",{"$f":"IF(메인!J8>=5,메인!F22,\"\")","v":"창의적 교량 만들기"},"글자 수\n\n(참고)"]
[null,null,"평가 내용",{"$f":"IF(메인!J8>=5,메인!H22,\"\")","v":"교량의 일반적인 구조물에 대한 이해를 통하여 주어진 재료를 이용하여 창의적인 교량 구조물을 만들 수 있음"}]
[null,null,"A","교량의 일반적인 구조물에 대한 이해가 잘되어 있어 교각과 상판 및 상부 구조간 각 연결부의 완성이 매우 잘 되어있음.",{"$f":"IF(D7=\"\",\"\",LEN(D7))","v":65}]
[null,null,"B","교량의 일반적인 구조물에 대한 이해가 다소 부족했지만 교각과 상판 및 상부 구조 간 각 연결부의 완성이 잘 된 편임.",{"$f":"IF(D8=\"\",\"\",LEN(D8))","v":65}]
[null,null,"C","교량의 일반적인 구조물에 대한 이해가 많이 부족하여 교각과 상판 및 상부 구조 간 각 연결부의 완성이 잘 되어있지 못함.",{"$f":"IF(D9=\"\",\"\",LEN(D9))","v":67}]
[null,null,"D",null,{"$f":"IF(D10=\"\",\"\",LEN(D10))","v":""}]
[null,null,"E",null,{"$f":"IF(D11=\"\",\"\",LEN(D11))","v":""}]
[{"$nulls":4},{"$f":"메인!D4&\"학업성적관리위원회\"","v":"충남중학교학업성적관리위원회"}]

{"sheet":"자유6","index":15,"n_rows":12,"n_cols":5,"rows_kept":12,"merged":[[1,2,1,4],[2,2,2,4],[4,4,5,4]]}
[]
[null,null,{"$f":"\"자유학기 과정 중심 평가 결과 서술 내용 (\"&메인!H8&\") - 6\"","v":"자유학기 과정 중심 평가 결과 서술 내용 (주제선택 활동) - 6"}]
[null,null,"( 등급을 판정하는 기준이 아니라, 평가 결과로서 학교생활기록부에 특기사항으로 기록될 등급별 내용 입니다. )"]
[]
[null,null,"평가 주제",{"$f":"IF(메인!J8>=6,메인!F23,\"\")","v":""},"글자 수\n\n(참고)"]
[null,null,"평가 내용",{"$f":"IF(메인!J8>=6,메인!H23,\"\")","v":""}]
[null,null,"A",null,{"$f":"IF(D7=\"\",\"\",LEN(D7))","v":""}]
[null,null,"B",null,{"$f":"IF(D8=\"\",\"\",LEN(D8))","v":""}]
[null,null,"C",null,{"$f":"IF(D9=\"\",\"\",LEN(D9))","v":""}]
[null,null,"D",null,{"$f":"IF(D10=\"\",\"\",LEN(D10))","v":""}]
[null,null,"E",null,{"$f":"IF(D11=\"\",\"\",LEN(D11))","v":""}]
[{"$nulls":4},{"$f":"메인!D4&\"학업성적관리위원회\"","v":"충남중학교학업성적관리위원회"}]

{"sheet":"자유7","index":16,"n_rows":12,"n_cols":5,"rows_kept":12,"merged":[[1,2,1,4],[2,2,2,4],[4,4,5,4]]}
[]
[null,null,{"$f":"\"자유학기 과정 중심 평가 결과 서술 내용 (\"&메인!H8&\") - 7\"","v":"자유학기 과정 중심 평가 결과 서술 내용 (주제선택 활동) - 7"}]
[null,null,"( 등급을 판정하는 기준이 아니라, 평가 결과로서 학교생활기록부에 특기사항으로 기록될 등급별 내용 입니다. )"]
[]
[null,null,"평가 주제",{"$f":"IF(메인!J8>=7,메인!F24,\"\")","v":""},"글자 수\n\n(참고)"]
[null,null,"평가 내용",{"$f":"IF(메인!J8>=7,메인!H24,\"\")","v":""}]
[null,null,"A",null,{"$f":"IF(D7=\"\",\"\",LEN(D7))","v":""}]
[null,null,"B",null,{"$f":"IF(D8=\"\",\"\",LEN(D8))","v":""}]
[null,null,"C",null,{"$f":"IF(D9=\"\",\"\",LEN(D9))","v":""}]
[null,null,"D",null,{"$f":"IF(D10=\"\",\"\",LEN(D10))","v":""}]
[null,null,"E",null,{"$f":"IF(D11=\"\",\"\",LEN(D11))","v":""}]
[{"$nulls":4},{"$f":"메인!D4&\"학업성적관리위원회\"","v":"충남중학교학업성적관리위원회"}]

{"sheet":"평가_자유","index":17,"n_rows":47,"n_cols":24,"rows_kept":47,"merged":[[1,2,1,11],[4,2,5,2],[4,3,5,3],[4,4,5,4],[4,5,5,5],[4,6,5,6],[4,7,5,7],[4,8,5,8],[4,9,5,9],[4,10,5,10],[4,11,5,11],[4,14,5,14],[4,15,5,15],[4,16,5,16],[4,17,5,17],[4,18,5,18],[4,19,5,19],[4,20,5,20],[4,22,5,22],[4,23,5,23]]}
[]
[null,null,{"$f":"\"자유학기 과정 중심 평가 결과 (자유학기 활동 - \"&메인!H8&\")\"","v":"자유학기 과정 중심 평가 결과 (자유학기 활동 - 주제선택 활동)"}]
[]
[null,null,{"$f":"메인!G4&메인!F4&\"  \"&메인!I4&메인!H4&\"  \"&메인!K4&메인!J4&\"  \"&메인!D6&메인!C6&\" - (\"&메인!K8&\")\"","v":"2018학년도  2학기  1학년  1반 - (1기)"},{"$nulls":8},{"$f":"\"지도교사 : \"&메인!G8&\"  (인)\"","v":"지도교사 : 이자유  (인)"}]
[null,null,"번호","성명",{"$f":"IF(메인!J8>=1,메인!F18,\"\")","v":"재료의 가공"},{"$f":"IF(메인!J8>=2,메인!F19,\"\")","v":"전통 한옥 목재 맞춤 제작"},{"$f":"IF(메인!J8>=3,메인!F20,\"\")","v":"창의적 계단 모형 만들기"},{"$f":"IF(메인!J8>=4,메인!F21,\"\")","v":"창의적 모형주택 만들기"},{"$f":"IF(메인!J8>=5,메인!F22,\"\")","v":"창의적 교량 만들기"},{"$f":"IF(메인!J8>=6,메인!F23,\"\")","v":""},{"$f":"IF(메인!J8>=7,메인!F24,\"\")","v":""},"비  고",null,null,{"$f":"IF(메인!J8>=1,메인!F18,\"\")","v":"재료의 가공"},{"$f":"IF(메인!J8>=2,메인!F19,\"\")","v":"전통 한옥 목재 맞춤 제작"},{"$f":"IF(메인!J8>=3,메인!F20,\"\")","v":"창의적 계단 모형 만들기"},{"$f":"IF(메인!J8>=4,메인!F21,\"\")","v":"창의적 모형주택 만들기"},{"$f":"IF(메인!J8>=5,메인!F22,\"\")","v":"창의적 교량 만들기"},{"$f":"IF(메인!J8>=6,메인!F23,\"\")","v":""},{"$f":"IF(메인!J8>=7,메인!F24,\"\")","v":""},null,{"$f":"메인!J7","v":4},"글자 수"]
[]
[null,null,1,{"$f":"IF(설정!D5=\"\",\"\",설정!D5)","v":"학생 1"},"A","C","A","B","C",{"$nulls":5},{"$f":"IF(OR($E$5=\"\",E7=\"전입\",E7=\"전출\",E7=\"\"),\"\",VLOOKUP(E7,서술_자율1,2,FALSE))","v":"안전 수칙을 준수하며 도구를 이용한 각종 재료(하드보드지, 우드락, 폼보드, 목재)의 자르기를 원하는 치수와 모양대로 안정감 있게 잘 하였음."},{"$f":"IF(OR($F$5=\"\",F7=\"전입\",F7=\"전출\",F7=\"\"),\"\",VLOOKUP(F7,서술_자율2,2,FALSE))","v":"한옥의 짜맞춤 구조물 만들기 과정에 대한 부품 제작 및 조립 기능이 부족하여 완성도가 낮음."},{"$f":"IF(OR($G$5=\"\",G7=\"전입\",G7=\"전출\",G7=\"\"),\"\",VLOOKUP(G7,서술_자율3,2,FALSE))","v":"실내외 통로 구조물로서 입체적인 계단의 구성 및 벽면과의 배치가 매우 잘 되었음."},{"$f":"IF(OR($H$5=\"\",H7=\"전입\",H7=\"전출\",H7=\"\"),\"\",VLOOKUP(H7,서술_자율4,2,FALSE))","v":"4인 가족의 주거공간 구상과 설계가 평범한 상태에서 주어진 재료를 이용한 주택 구상과 설계는 다소 미흡하나 가공 및 조립과 꾸미기로 모형주택을 적당하게 만들었음."},{"$f":"IF(OR($I$5=\"\",I7=\"전입\",I7=\"전출\",I7=\"\"),\"\",VLOOKUP(I7,서술_자율5,2,FALSE))","v":"교량의 일반적인 구조물에 대한 이해가 많이 부족하여 교각과 상판 및 상부 구조 간 각 연결부의 완성이 잘 되어있지 못함."},{"$f":"IF(OR($J$5=\"\",J7=\"전입\",J7=\"전출\",J7=\"\"),\"\",VLOOKUP(J7,서술_자율6,2,FALSE))","v":""},{"$f":"IF(OR($K$5=\"\",K7=\"전입\",K7=\"전출\",K7=\"\"),\"\",VLOOKUP(K7,서술_자율7,2,FALSE))","v":""},null,{"$f":"IF(COUNTBLANK(O7:U7)=7,\"\",IF($W$5=1,O7,IF($W$5=2,O7&\" \"&P7,IF($W$5=3,O7&\" \"&P7&\" \"&Q7,IF($W$5=4,O7&\" \"&P7&\" \"&Q7&\" \"&R7,IF($W$5=5,O7&\" \"&P7&\" \"&Q7&\" \"&R7&\" \"&S7,IF($W$5=6,O7&\" \"&P7&\" \"&Q7&\" \"&R7&\" \"&S7&\" \"&T7,IF($W$5=7,O7&\" \"&P7&\" \"&Q7&\" \"&R7&\" \"&S7&\" \"&T7&\" \"&U7,\"\"))))))))","v":"안전 수칙을 준수하며 도구를 이용한 각종 재료(하드보드지, 우드락, 폼보드, 목재)의 자르기를 원하는 치수와 모양대로 안정감 있게 잘 하였음. 한옥의 짜맞춤 구조물 만들기 과정에 대한 부품 제작 및 조립 기능이 부족하여 완성도가 낮음. 실내외 통로 구조물로서 입체적인 계단의 구성 및 벽면과의 배치가 매우 잘 되었음. 4인 가족의 주거공간 구상과 설계가 평범한 상태에서 주어진 재료를 이용한 주택 구상과 설계는 다소 미흡하나 가공 및 조립과 꾸미기로 모형주택을 적당하게 만들었음."},{"$f":"LEN(W7)","v":268}]
[null,null,2,{"$f":"IF(설정!D6=\"\",\"\",설정!D6)","v":"학생 2"},{"$nulls":10},{"$f":"IF(OR($E$5=\"\",E8=\"전입\",E8=\"전출\",E8=\"\"),\"\",VLOOKUP(E8,서술_자율1,2,FALSE))","v":""},{"$f":"IF(OR($F$5=\"\",F8=\"전입\",F8=\"전출\",F8=\"\"),\"\",VLOOKUP(F8,서술_자율2,2,FALSE))","v":""},{"$f":"IF(OR($G$5=\"\",G8=\"전입\",G8=\"전출\",G8=\"\"),\"\",VLOOKUP(G8,서술_자율3,2,FALSE))","v":""},{"$f":"IF(OR($H$5=\"\",H8=\"전입\",H8=\"전출\",H8=\"\"),\"\",VLOOKUP(H8,서술_자율4,2,FALSE))","v":""},{"$f":"IF(OR($I$5=\"\",I8=\"전입\",I8=\"전출\",I8=\"\"),\"\",VLOOKUP(I8,서술_자율5,2,FALSE))","v":""},{"$f":"IF(OR($J$5=\"\",J8=\"전입\",J8=\"전출\",J8=\"\"),\"\",VLOOKUP(J8,서술_자율6,2,FALSE))","v":""},{"$f":"IF(OR($K$5=\"\",K8=\"전입\",K8=\"전출\",K8=\"\"),\"\",VLOOKUP(K8,서술_자율7,2,FALSE))","v":""},null,{"$f":"IF(COUNTBLANK(O8:U8)=7,\"\",IF($W$5=1,O8,IF($W$5=2,O8&\" \"&P8,IF($W$5=3,O8&\" \"&P8&\" \"&Q8,IF($W$5=4,O8&\" \"&P8&\" \"&Q8&\" \"&R8,IF($W$5=5,O8&\" \"&P8&\" \"&Q8&\" \"&R8&\" \"&S8,IF($W$5=6,O8&\" \"&P8&\" \"&Q8&\" \"&R8&\" \"&S8&\" \"&T8,IF($W$5=7,O8&\" \"&P8&\" \"&Q8&\" \"&R8&\" \"&S8&\" \"&T8&\" \"&U8,\"\"))))))))","v":""},{"$f":"LEN(W8)","v":0}]
[null,null,3,{"$f":"IF(설정!D7=\"\",\"\",설정!D7)","v":"학생 3"},"B","B","B","C","A",{"$nulls":5},"안전 수칙을 준수하였으나 도구를 이용한 각종 재료(하드보드지, 우드락, 폼보드, 목재)의 자르기에서 일부 재료는 원하는 치수와 모양대로 처리함이 다소 부족하였음.","한옥의 짜맞춤 구조물 부품의 제작과 조립이 양호하여 일반적인 작품으로서의 완성을 하였음.","실내외 통로 구조물로서 단순한 계단의 구성 및 벽면과의 배치가 양호한 편임.","4인 가족의 주거공간 구상과 설계가 부족한 상태에서 주어진 재료를 이용한 주택 구상과 설계가 미흡하고 부품 가공과 조립 및 꾸미기 작업이 대체로 서툴렀음.","교량의 일반적인 구조물에 대한 이해가 잘되어 있어 교각과 상판 및 상부 구조간 각 연결부의 완성이 매우 잘 되어있음.","","",null,"안전 수칙을 준수하였으나 도구를 이용한 각종 재료(하드보드지, 우드락, 폼보드, 목재)의 자르기에서 일부 재료는 원하는 치수와 모양대로 처리함이 다소 부족하였음. 한옥의 짜맞춤 구조물 부품의 제작과 조립이 양호하여 일반적인 작품으로서의 완성을 하였음. 실내외 통로 구조물로서 단순한 계단의 구성 및 벽면과의 배치가 양호한 편임. 4인 가족의 주거공간 구상과 설계가 부족한 상태에서 주어진 재료를 이용한 주택 구상과 설계가 미흡하고 부품 가공과 조립 및 꾸미기 작업이 대체로 서툴렀음.",270]
[null,null,4,{"$f":"IF(설정!D8=\"\",\"\",설정!D8)","v":"학생 4"},{"$nulls":10},"","","","","","","",null,"",0]
[null,null,5,{"$f":"IF(설정!D9=\"\",\"\",설정!D9)","v":"학생 5"},"A","A","B","C","A",{"$nulls":5},"안전 수칙을 준수하며 도구를 이용한 각종 재료(하드보드지, 우드락, 폼보드, 목재)의 자르기를 원하는 치수와 모양대로 안정감 있게 잘 하였음.","한옥의 짜맞춤 구조물 만들기에서 부품의 제작이 정확하고 조립이 견고하여 완성도가 높음.","실내외 통로 구조물로서 단순한 계단의 구성 및 벽면과의 배치가 양호한 편임.","4인 가족의 주거공간 구상과 설계가 부족한 상태에서 주어진 재료를 이용한 주택 구상과 설계가 미흡하고 부품 가공과 조립 및 꾸미기 작업이 대체로 서툴렀음.","교량의 일반적인 구조물에 대한 이해가 잘되어 있어 교각과 상판 및 상부 구조간 각 연결부의 완성이 매우 잘 되어있음.","","",null,"안전 수칙을 준수하며 도구를 이용한 각종 재료(하드보드지, 우드락, 폼보드, 목재)의 자르기를 원하는 치수와 모양대로 안정감 있게 잘 하였음. 한옥의 짜맞춤 구조물 만들기에서 부품의 제작이 정확하고 조립이 견고하여 완성도가 높음. 실내외 통로 구조물로서 단순한 계단의 구성 및 벽면과의 배치가 양호한 편임. 4인 가족의 주거공간 구상과 설계가 부족한 상태에서 주어진 재료를 이용한 주택 구상과 설계가 미흡하고 부품 가공과 조립 및 꾸미기 작업이 대체로 서툴렀음.",258]
[null,null,6,{"$f":"IF(설정!D10=\"\",\"\",설정!D10)","v":"학생 6"},"B","C","B","A","A",{"$nulls":5},"안전 수칙을 준수하였으나 도구를 이용한 각종 재료(하드보드지, 우드락, 폼보드, 목재)의 자르기에서 일부 재료는 원하는 치수와 모양대로 처리함이 다소 부족하였음.","한옥의 짜맞춤 구조물 만들기 과정에 대한 부품 제작 및 조립 기능이 부족하여 완성도가 낮음.","실내외 통로 구조물로서 단순한 계단의 구성 및 벽면과의 배치가 양호한 편임.","4인 가족의 주거공간 구상과 설계가 잘된 상태에서 주어진 재료를 이용한 부품 가공과 조립 및 꾸미기로 모형주택을 잘 만들었음.","교량의 일반적인 구조물에 대한 이해가 잘되어 있어 교각과 상판 및 상부 구조간 각 연결부의 완성이 매우 잘 되어있음.","","",null,"안전 수칙을 준수하였으나 도구를 이용한 각종 재료(하드보드지, 우드락, 폼보드, 목재)의 자르기에서 일부 재료는 원하는 치수와 모양대로 처리함이 다소 부족하였음. 한옥의 짜맞춤 구조물 만들기 과정에 대한 부품 제작 및 조립 기능이 부족하여 완성도가 낮음. 실내외 통로 구조물로서 단순한 계단의 구성 및 벽면과의 배치가 양호한 편임. 4인 가족의 주거공간 구상과 설계가 잘된 상태에서 주어진 재료를 이용한 부품 가공과 조립 및 꾸미기로 모형주택을 잘 만들었음.",256]
[null,null,7,{"$f":"IF(설정!D11=\"\",\"\",설정!D11)","v":"학생 7"},"B","A","B","B","A",{"$nulls":5},"안전 수칙을 준수하였으나 도구를 이용한 각종 재료(하드보드지, 우드락, 폼보드, 목재)의 자르기에서 일부 재료는 원하는 치수와 모양대로 처리함이 다소 부족하였음.","한옥의 짜맞춤 구조물 만들기에서 부품의 제작이 정확하고 조립이 견고하여 완성도가 높음.","실내외 통로 구조물로서 단순한 계단의 구성 및 벽면과의 배치가 양호한 편임.","4인 가족의 주거공간 구상과 설계가 평범한 상태에서 주어진 재료를 이용한 주택 구상과 설계는 다소 미흡하나 가공 및 조립과 꾸미기로 모형주택을 적당하게 만들었음.","교량의 일반적인 구조물에 대한 이해가 잘되어 있어 교각과 상판 및 상부 구조간 각 연결부의 완성이 매우 잘 되어있음.","","",null,"안전 수칙을 준수하였으나 도구를 이용한 각종 재료(하드보드지, 우드락, 폼보드, 목재)의 자르기에서 일부 재료는 원하는 치수와 모양대로 처리함이 다소 부족하였음. 한옥의 짜맞춤 구조물 만들기에서 부품의 제작이 정확하고 조립이 견고하여 완성도가 높음. 실내외 통로 구조물로서 단순한 계단의 구성 및 벽면과의 배치가 양호한 편임. 4인 가족의 주거공간 구상과 설계가 평범한 상태에서 주어진 재료를 이용한 주택 구상과 설계는 다소 미흡하나 가공 및 조립과 꾸미기로 모형주택을 적당하게 만들었음.",273]
[null,null,8,{"$f":"IF(설정!D12=\"\",\"\",설정!D12)","v":"학생 8"},"A","B","B","C","B",{"$nulls":5},"안전 수칙을 준수하며 도구를 이용한 각종 재료(하드보드지, 우드락, 폼보드, 목재)의 자르기를 원하는 치수와 모양대로 안정감 있게 잘 하였음.","한옥의 짜맞춤 구조물 부품의 제작과 조립이 양호하여 일반적인 작품으로서의 완성을 하였음.","실내외 통로 구조물로서 단순한 계단의 구성 및 벽면과의 배치가 양호한 편임.","4인 가족의 주거공간 구상과 설계가 부족한 상태에서 주어진 재료를 이용한 주택 구상과 설계가 미흡하고 부품 가공과 조립 및 꾸미기 작업이 대체로 서툴렀음.","교량의 일반적인 구조물에 대한 이해가 다소 부족했지만 교각과 상판 및 상부 구조 간 각 연결부의 완성이 잘 된 편임.","","",null,"안전 수칙을 준수하며 도구를 이용한 각종 재료(하드보드지, 우드락, 폼보드, 목재)의 자르기를 원하는 치수와 모양대로 안정감 있게 잘 하였음. 한옥의 짜맞춤 구조물 부품의 제작과 조립이 양호하여 일반적인 작품으로서의 완성을 하였음. 실내외 통로 구조물로서 단순한 계단의 구성 및 벽면과의 배치가 양호한 편임. 4인 가족의 주거공간 구상과 설계가 부족한 상태에서 주어진 재료를 이용한 주택 구상과 설계가 미흡하고 부품 가공과 조립 및 꾸미기 작업이 대체로 서툴렀음.",259]
[null,null,9,{"$f":"IF(설정!D13=\"\",\"\",설정!D13)","v":"학생 9"},{"$nulls":10},"","","","","","","",null,"",0]
[null,null,10,{"$f":"IF(설정!D14=\"\",\"\",설정!D14)","v":"학생10"},{"$nulls":10},"","","","","","","",null,"",0]
[null,null,11,{"$f":"IF(설정!D15=\"\",\"\",설정!D15)","v":"학생11"},"A","A","A","B","B",{"$nulls":5},"안전 수칙을 준수하며 도구를 이용한 각종 재료(하드보드지, 우드락, 폼보드, 목재)의 자르기를 원하는 치수와 모양대로 안정감 있게 잘 하였음.","한옥의 짜맞춤 구조물 만들기에서 부품의 제작이 정확하고 조립이 견고하여 완성도가 높음.","실내외 통로 구조물로서 입체적인 계단의 구성 및 벽면과의 배치가 매우 잘 되었음.","4인 가족의 주거공간 구상과 설계가 평범한 상태에서 주어진 재료를 이용한 주택 구상과 설계는 다소 미흡하나 가공 및 조립과 꾸미기로 모형주택을 적당하게 만들었음.","교량의 일반적인 구조물에 대한 이해가 다소 부족했지만 교각과 상판 및 상부 구조 간 각 연결부의 완성이 잘 된 편임.","","",null,"안전 수칙을 준수하며 도구를 이용한 각종 재료(하드보드지, 우드락, 폼보드, 목재)의 자르기를 원하는 치수와 모양대로 안정감 있게 잘 하였음. 한옥의 짜맞춤 구조물 만들기에서 부품의 제작이 정확하고 조립이 견고하여 완성도가 높음. 실내외 통로 구조물로서 입체적인 계단의 구성 및 벽면과의 배치가 매우 잘 되었음. 4인 가족의 주거공간 구상과 설계가 평범한 상태에서 주어진 재료를 이용한 주택 구상과 설계는 다소 미흡하나 가공 및 조립과 꾸미기로 모형주택을 적당하게 만들었음.",265]
[null,null,12,{"$f":"IF(설정!D16=\"\",\"\",설정!D16)","v":"학생12"},{"$nulls":10},"","","","","","","",null,"",0]
[null,null,13,{"$f":"IF(설정!D17=\"\",\"\",설정!D17)","v":"학생13"},"B","C","B","A","A",{"$nulls":5},"안전 수칙을 준수하였으나 도구를 이용한 각종 재료(하드보드지, 우드락, 폼보드, 목재)의 자르기에서 일부 재료는 원하는 치수와 모양대로 처리함이 다소 부족하였음.","한옥의 짜맞춤 구조물 만들기 과정에 대한 부품 제작 및 조립 기능이 부족하여 완성도가 낮음.","실내외 통로 구조물로서 단순한 계단의 구성 및 벽면과의 배치가 양호한 편임.","4인 가족의 주거공간 구상과 설계가 잘된 상태에서 주어진 재료를 이용한 부품 가공과 조립 및 꾸미기로 모형주택을 잘 만들었음.","교량의 일반적인 구조물에 대한 이해가 잘되어 있어 교각과 상판 및 상부 구조간 각 연결부의 완성이 매우 잘 되어있음.","","",null,"안전 수칙을 준수하였으나 도구를 이용한 각종 재료(하드보드지, 우드락, 폼보드, 목재)의 자르기에서 일부 재료는 원하는 치수와 모양대로 처리함이 다소 부족하였음. 한옥의 짜맞춤 구조물 만들기 과정에 대한 부품 제작 및 조립 기능이 부족하여 완성도가 낮음. 실내외 통로 구조물로서 단순한 계단의 구성 및 벽면과의 배치가 양호한 편임. 4인 가족의 주거공간 구상과 설계가 잘된 상태에서 주어진 재료를 이용한 부품 가공과 조립 및 꾸미기로 모형주택을 잘 만들었음.",256]
[null,null,14,{"$f":"IF(설정!D18=\"\",\"\",설정!D18)","v":"학생14"},{"$nulls":10},"","","","","","","",null,"",0]
[null,null,15,{"$f":"IF(설정!D19=\"\",\"\",설정!D19)","v":"학생15"},{"$nulls":10},"","","","","","","",null,"",0]
[null,null,16,{"$f":"IF(설정!D20=\"\",\"\",설정!D20)","v":"학생16"},"B","B","A","C","전출",{"$nulls":5},"안전 수칙을 준수하였으나 도구를 이용한 각종 재료(하드보드지, 우드락, 폼보드, 목재)의 자르기에서 일부 재료는 원하는 치수와 모양대로 처리함이 다소 부족하였음.","한옥의 짜맞춤 구조물 부품의 제작과 조립이 양호하여 일반적인 작품으로서의 완성을 하였음.","실내외 통로 구조물로서 입체적인 계단의 구성 및 벽면과의 배치가 매우 잘 되었음.","4인 가족의 주거공간 구상과 설계가 부족한 상태에서 주어진 재료를 이용한 주택 구상과 설계가 미흡하고 부품 가공과 조립 및 꾸미기 작업이 대체로 서툴렀음.","","","",null,"안전 수칙을 준수하였으나 도구를 이용한 각종 재료(하드보드지, 우드락, 폼보드, 목재)의 자르기에서 일부 재료는 원하는 치수와 모양대로 처리함이 다소 부족하였음. 한옥의 짜맞춤 구조물 부품의 제작과 조립이 양호하여 일반적인 작품으로서의 완성을 하였음. 실내외 통로 구조물로서 입체적인 계단의 구성 및 벽면과의 배치가 매우 잘 되었음. 4인 가족의 주거공간 구상과 설계가 부족한 상태에서 주어진 재료를 이용한 주택 구상과 설계가 미흡하고 부품 가공과 조립 및 꾸미기 작업이 대체로 서툴렀음.",273]
[null,null,17,{"$f":"IF(설정!D21=\"\",\"\",설정!D21)","v":"학생17"},"C","B","C","B","A",{"$nulls":5},"안전 수칙이 잘 지켜지지 않고 도구를 이용한 각종 재료(하드보드지, 우드락, 폼보드, 목재)의 자르기를 원하는 치수와 모양대로 하는데 어려움을 겪었음.","한옥의 짜맞춤 구조물 부품의 제작과 조립이 양호하여 일반적인 작품으로서의 완성을 하였음.","실내외 통로 구조물로서 계단의 구성 및 벽면과의 배치가 잘 이루어지지 않았음.","4인 가족의 주거공간 구상과 설계가 평범한 상태에서 주어진 재료를 이용한 주택 구상과 설계는 다소 미흡하나 가공 및 조립과 꾸미기로 모형주택을 적당하게 만들었음.","교량의 일반적인 구조물에 대한 이해가 잘되어 있어 교각과 상판 및 상부 구조간 각 연결부의 완성이 매우 잘 되어있음.","","",null,"안전 수칙이 잘 지켜지지 않고 도구를 이용한 각종 재료(하드보드지, 우드락, 폼보드, 목재)의 자르기를 원하는 치수와 모양대로 하는데 어려움을 겪었음. 한옥의 짜맞춤 구조물 부품의 제작과 조립이 양호하여 일반적인 작품으로서의 완성을 하였음. 실내외 통로 구조물로서 계단의 구성 및 벽면과의 배치가 잘 이루어지지 않았음. 4인 가족의 주거공간 구상과 설계가 평범한 상태에서 주어진 재료를 이용한 주택 구상과 설계는 다소 미흡하나 가공 및 조립과 꾸미기로 모형주택을 적당하게 만들었음.",269]
[null,null,18,{"$f":"IF(설정!D22=\"\",\"\",설정!D22)","v":"학생18"},"A","A","A","B","B",{"$nulls":5},"안전 수칙을 준수하며 도구를 이용한 각종 재료(하드보드지, 우드락, 폼보드, 목재)의 자르기를 원하는 치수와 모양대로 안정감 있게 잘 하였음.","한옥의 짜맞춤 구조물 만들기에서 부품의 제작이 정확하고 조립이 견고하여 완성도가 높음.","실내외 통로 구조물로서 입체적인 계단의 구성 및 벽면과의 배치가 매우 잘 되었음.","4인 가족의 주거공간 구상과 설계가 평범한 상태에서 주어진 재료를 이용한 주택 구상과 설계는 다소 미흡하나 가공 및 조립과 꾸미기로 모형주택을 적당하게 만들었음.","교량의 일반적인 구조물에 대한 이해가 다소 부족했지만 교각과 상판 및 상부 구조 간 각 연결부의 완성이 잘 된 편임.","","",null,"안전 수칙을 준수하며 도구를 이용한 각종 재료(하드보드지, 우드락, 폼보드, 목재)의 자르기를 원하는 치수와 모양대로 안정감 있게 잘 하였음. 한옥의 짜맞춤 구조물 만들기에서 부품의 제작이 정확하고 조립이 견고하여 완성도가 높음. 실내외 통로 구조물로서 입체적인 계단의 구성 및 벽면과의 배치가 매우 잘 되었음. 4인 가족의 주거공간 구상과 설계가 평범한 상태에서 주어진 재료를 이용한 주택 구상과 설계는 다소 미흡하나 가공 및 조립과 꾸미기로 모형주택을 적당하게 만들었음.",265]
[null,null,19,{"$f":"IF(설정!D23=\"\",\"\",설정!D23)","v":"학생19"},{"$nulls":10},"","","","","","","",null,"",0]
[null,null,20,{"$f":"IF(설정!D24=\"\",\"\",설정!D24)","v":"학생20"},{"$nulls":10},"","","","","","","",null,"",0]
[null,null,21,{"$f":"IF(설정!D25=\"\",\"\",설정!D25)","v":"학생21"},"A","B","B","C","B",{"$nulls":5},"안전 수칙을 준수하며 도구를 이용한 각종 재료(하드보드지, 우드락, 폼보드, 목재)의 자르기를 원하는 치수와 모양대로 안정감 있게 잘 하였음.","한옥의 짜맞춤 구조물 부품의 제작과 조립이 양호하여 일반적인 작품으로서의 완성을 하였음.","실내외 통로 구조물로서 단순한 계단의 구성 및 벽면과의 배치가 양호한 편임.","4인 가족의 주거공간 구상과 설계가 부족한 상태에서 주어진 재료를 이용한 주택 구상과 설계가 미흡하고 부품 가공과 조립 및 꾸미기 작업이 대체로 서툴렀음.","교량의 일반적인 구조물에 대한 이해가 다소 부족했지만 교각과 상판 및 상부 구조 간 각 연결부의 완성이 잘 된 편임.","","",null,"안전 수칙을 준수하며 도구를 이용한 각종 재료(하드보드지, 우드락, 폼보드, 목재)의 자르기를 원하는 치수와 모양대로 안정감 있게 잘 하였음. 한옥의 짜맞춤 구조물 부품의 제작과 조립이 양호하여 일반적인 작품으로서의 완성을 하였음. 실내외 통로 구조물로서 단순한 계단의 구성 및 벽면과의 배치가 양호한 편임. 4인 가족의 주거공간 구상과 설계가 부족한 상태에서 주어진 재료를 이용한 주택 구상과 설계가 미흡하고 부품 가공과 조립 및 꾸미기 작업이 대체로 서툴렀음.",259]
[null,null,22,{"$f":"IF(설정!D26=\"\",\"\",설정!D26)","v":"학생22"},{"$nulls":10},"","","","","","","",null,"",0]
[null,null,23,{"$f":"IF(설정!D27=\"\",\"\",설정!D27)","v":"학생23"},"C","B","C","C","B",{"$nulls":5},"안전 수칙이 잘 지켜지지 않고 도구를 이용한 각종 재료(하드보드지, 우드락, 폼보드, 목재)의 자르기를 원하는 치수와 모양대로 하는데 어려움을 겪었음.","한옥의 짜맞춤 구조물 부품의 제작과 조립이 양호하여 일반적인 작품으로서의 완성을 하였음.","실내외 통로 구조물로서 계단의 구성 및 벽면과의 배치가 잘 이루어지지 않았음.","4인 가족의 주거공간 구상과 설계가 부족한 상태에서 주어진 재료를 이용한 주택 구상과 설계가 미흡하고 부품 가공과 조립 및 꾸미기 작업이 대체로 서툴렀음.","교량의 일반적인 구조물에 대한 이해가 다소 부족했지만 교각과 상판 및 상부 구조 간 각 연결부의 완성이 잘 된 편임.","","",null,"안전 수칙이 잘 지켜지지 않고 도구를 이용한 각종 재료(하드보드지, 우드락, 폼보드, 목재)의 자르기를 원하는 치수와 모양대로 하는데 어려움을 겪었음. 한옥의 짜맞춤 구조물 부품의 제작과 조립이 양호하여 일반적인 작품으로서의 완성을 하였음. 실내외 통로 구조물로서 계단의 구성 및 벽면과의 배치가 잘 이루어지지 않았음. 4인 가족의 주거공간 구상과 설계가 부족한 상태에서 주어진 재료를 이용한 주택 구상과 설계가 미흡하고 부품 가공과 조립 및 꾸미기 작업이 대체로 서툴렀음.",265]
[null,null,24,{"$f":"IF(설정!D28=\"\",\"\",설정!D28)","v":"학생24"},{"$nulls":10},"","","","","","","",null,"",0]
[null,null,25,{"$f":"IF(설정!D29=\"\",\"\",설정!D29)","v":"학생25"},"전입","A","B","A","A",{"$nulls":5},"","한옥의 짜맞춤 구조물 만들기에서 부품의 제작이 정확하고 조립이 견고하여 완성도가 높음.","실내외 통로 구조물로서 단순한 계단의 구성 및 벽면과의 배치가 양호한 편임.","4인 가족의 주거공간 구상과 설계가 잘된 상태에서 주어진 재료를 이용한 부품 가공과 조립 및 꾸미기로 모형주택을 잘 만들었음.","교량의 일반적인 구조물에 대한 이해가 잘되어 있어 교각과 상판 및 상부 구조간 각 연결부의 완성이 매우 잘 되어있음.","","",null," 한옥의 짜맞춤 구조물 만들기에서 부품의 제작이 정확하고 조립이 견고하여 완성도가 높음. 실내외 통로 구조물로서 단순한 계단의 구성 및 벽면과의 배치가 양호한 편임. 4인 가족의 주거공간 구상과 설계가 잘된 상태에서 주어진 재료를 이용한 부품 가공과 조립 및 꾸미기로 모형주택을 잘 만들었음.",163]
[null,null,26,{"$f":"IF(설정!D30=\"\",\"\",설정!D30)","v":""},{"$nulls":10},"","","","","","","",null,"",0]
[null,null,27,{"$f":"IF(설정!D31=\"\",\"\",설정!D31)","v":""},{"$nulls":10},"","","","","","","",null,"",0]
[null,null,28,{"$f":"IF(설정!D32=\"\",\"\",설정!D32)","v":""},{"$nulls":10},"","","","","","","",null,"",0]
[null,null,29,{"$f":"IF(설정!D33=\"\",\"\",설정!D33)","v":""},{"$nulls":10},"","","","","","","",null,"",0]
[null,null,30,{"$f":"IF(설정!D34=\"\",\"\",설정!D34)","v":""},{"$nulls":10},"","","","","","","",null,"",0]
[null,null,31,{"$f":"IF(설정!D35=\"\",\"\",설정!D35)","v":""},{"$nulls":10},"","","","","","","",null,"",0]
[null,null,32,{"$f":"IF(설정!D36=\"\",\"\",설정!D36)","v":""},{"$nulls":10},"","","","","","","",null,"",0]
[null,null,33,{"$f":"IF(설정!D37=\"\",\"\",설정!D37)","v":""},{"$nulls":10},"","","","","","","",null,"",0]
[null,null,34,{"$f":"IF(설정!D38=\"\",\"\",설정!D38)","v":""},{"$nulls":10},"","","","","","","",null,"",0]
[null,null,35,{"$f":"IF(설정!D39=\"\",\"\",설정!D39)","v":""},{"$nulls":10},"","","","","","","",null,"",0]
[null,null,36,{"$f":"IF(설정!D40=\"\",\"\",설정!D40)","v":""},{"$nulls":10},"","","","","","","",null,"",0]
[null,null,37,{"$f":"IF(설정!D41=\"\",\"\",설정!D41)","v":""},{"$nulls":10},"","","","","","","",null,"",0]
[null,null,38,{"$f":"IF(설정!D42=\"\",\"\",설정!D42)","v":""},{"$nulls":10},"","","","","","","",null,"",0]
[null,null,39,{"$f":"IF(설정!D43=\"\",\"\",설정!D43)","v":""},{"$nulls":10},"","","","","","","",null,"",0]
[null,null,40,{"$f":"IF(설정!D44=\"\",\"\",설정!D44)","v":""},{"$nulls":10},"","","","","","","",null,"",0]
[{"$nulls":11},{"$f":"메인!D4&\"학업성적관리위원회\"","v":"충남중학교학업성적관리위원회"}]

{"sheet":"평가_종합","index":18,"n_rows":48,"n_cols":19,"rows_kept":48,"merged":[[1,2,1,18],[3,7,3,11],[4,2,4,3],[4,4,4,10],[4,11,4,17],[4,18,6,18],[5,2,6,2],[5,3,6,3],[5,4,6,4],[5,5,6,5],[5,6,6,6],[5,7,6,7],[5,8,6,8],[5,9,6,9],[5,10,6,10],[5,11,6,11],[5,12,6,12],[5,13,6,13],[5,14,6,14],[5,15,6,15],[5,16,6,16],[5,17,6,17]]}
[]
[null,null,{"$f":"\"자유학기 과정 중심 평가 결과 (\"&메인!H7&\" / \"&메인!H8&\")\"","v":"자유학기 과정 중심 평가 결과 (기술·가정 / 주제선택 활동)"}]
[]
[null,null,{"$f":"메인!G4&메인!F4&\"  \"&메인!I4&메인!H4&\"  \"&메인!K4&메인!J4&\"  \"&메인!D6&메인!C6","v":"2018학년도  2학기  1학년  1반"},{"$nulls":4},{"$f":"IF(메인!C7=\"\",\"\",\"과목 : \"&메인!D7&\" (\"& 메인!D8&\" 차시)\")","v":"과목 : 기술·가정 (51 차시)"},{"$nulls":10},{"$f":"IF(메인!G7=메인!G8,\"지도교사 : \"&메인!G7&\"  (인)\",\"지도교사 : \"&메인!G7&\"  (인)  ,   \"&메인!G8&\"  (인)\")","v":"지도교사 : 김교과  (인)  ,   이자유  (인)"}]
[null,null,"구  분",null,{"$f":"메인!E7&\" (\"& 메인!F7&\" 차시) - \"&메인!H7","v":"교과 (34 차시) - 기술·가정"},{"$nulls":6},{"$f":"메인!E8&\" (\"& 메인!F8&\" 차시) - \"&메인!H8","v":"자유학기 활동 (17 차시) - 주제선택 활동"},{"$nulls":6},"비  고"]
[null,null,"번\n호","성명",{"$f":"IF(메인!J7>=1,메인!F11,\"\")","v":"형성평가 - 질문법"},{"$f":"IF(메인!J7>=2,메인!F12,\"\")","v":"형성평가 - 평가지"},{"$f":"IF(메인!J7>=3,메인!F13,\"\")","v":"포트폴리오 - 학습활동지"},{"$f":"IF(메인!J7>=4,메인!F14,\"\")","v":"마인드 맵 작성"},{"$f":"IF(메인!J7>=5,메인!F15,\"\")","v":""},{"$f":"IF(메인!J7>=6,메인!F16,\"\")","v":""},{"$f":"IF(메인!J7>=7,메인!F17,\"\")","v":""},{"$f":"IF(메인!J8>=1,메인!F18,\"\")","v":"재료의 가공"},{"$f":"IF(메인!J8>=2,메인!F19,\"\")","v":"전통 한옥 목재 맞춤 제작"},{"$f":"IF(메인!J8>=3,메인!F20,\"\")","v":"창의적 계단 모형 만들기"},{"$f":"IF(메인!J8>=4,메인!F21,\"\")","v":"창의적 모형주택 만들기"},{"$f":"IF(메인!J8>=5,메인!F22,\"\")","v":"창의적 교량 만들기"},{"$f":"IF(메인!J8>=6,메인!F23,\"\")","v":""},{"$f":"IF(메인!J8>=7,메인!F24,\"\")","v":""}]
[]
[null,null,1,{"$f":"IF(설정!D5=\"\",\"\",설정!D5)","v":"학생 1"},{"$f":"IF(평가_교과!E7=\"\",\"\",평가_교과!E7)","v":"C"},{"$f":"IF(평가_교과!F7=\"\",\"\",평가_교과!F7)","v":"B"},{"$f":"IF(평가_교과!G7=\"\",\"\",평가_교과!G7)","v":"A"},{"$f":"IF(평가_교과!H7=\"\",\"\",평가_교과!H7)","v":"B"},{"$f":"IF(평가_교과!I7=\"\",\"\",평가_교과!I7)","v":""},{"$f":"IF(평가_교과!J7=\"\",\"\",평가_교과!J7)","v":""},{"$f":"IF(평가_교과!K7=\"\",\"\",평가_교과!K7)","v":""},{"$f":"IF(평가_자유!E7=\"\",\"\",평가_자유!E7)","v":"A"},{"$f":"IF(평가_자유!F7=\"\",\"\",평가_자유!F7)","v":"C"},{"$f":"IF(평가_자유!G7=\"\",\"\",평가_자유!G7)","v":"A"},{"$f":"IF(평가_자유!H7=\"\",\"\",평가_자유!H7)","v":"B"},{"$f":"IF(평가_자유!I7=\"\",\"\",평가_자유!I7)","v":"C"},{"$f":"IF(평가_자유!J7=\"\",\"\",평가_자유!J7)","v":""},{"$f":"IF(평가_자유!K7=\"\",\"\",평가_자유!K7)","v":""}]
[null,null,2,{"$f":"IF(설정!D6=\"\",\"\",설정!D6)","v":"학생 2"},{"$f":"IF(평가_교과!E8=\"\",\"\",평가_교과!E8)","v":"B"},{"$f":"IF(평가_교과!F8=\"\",\"\",평가_교과!F8)","v":"A"},{"$f":"IF(평가_교과!G8=\"\",\"\",평가_교과!G8)","v":"C"},{"$f":"IF(평가_교과!H8=\"\",\"\",평가_교과!H8)","v":"A"},{"$f":"IF(평가_교과!I8=\"\",\"\",평가_교과!I8)","v":""},{"$f":"IF(평가_교과!J8=\"\",\"\",평가_교과!J8)","v":""},{"$f":"IF(평가_교과!K8=\"\",\"\",평가_교과!K8)","v":""},{"$f":"IF(평가_자유!E8=\"\",\"\",평가_자유!E8)","v":""},{"$f":"IF(평가_자유!F8=\"\",\"\",평가_자유!F8)","v":""},{"$f":"IF(평가_자유!G8=\"\",\"\",평가_자유!G8)","v":""},{"$f":"IF(평가_자유!H8=\"\",\"\",평가_자유!H8)","v":""},{"$f":"IF(평가_자유!I8=\"\",\"\",평가_자유!I8)","v":""},{"$f":"IF(평가_자유!J8=\"\",\"\",평가_자유!J8)","v":""},{"$f":"IF(평가_자유!K8=\"\",\"\",평가_자유!K8)","v":""}]
[null,null,3,{"$f":"IF(설정!D7=\"\",\"\",설정!D7)","v":"학생 3"},{"$f":"IF(평가_교과!E9=\"\",\"\",평가_교과!E9)","v":"C"},{"$f":"IF(평가_교과!F9=\"\",\"\",평가_교과!F9)","v":"B"},{"$f":"IF(평가_교과!G9=\"\",\"\",평가_교과!G9)","v":"A"},{"$f":"IF(평가_교과!H9=\"\",\"\",평가_교과!H9)","v":"B"},{"$f":"IF(평가_교과!I9=\"\",\"\",평가_교과!I9)","v":""},{"$f":"IF(평가_교과!J9=\"\",\"\",평가_교과!J9)","v":""},{"$f":"IF(평가_교과!K9=\"\",\"\",평가_교과!K9)","v":""},{"$f":"IF(평가_자유!E9=\"\",\"\",평가_자유!E9)","v":"B"},{"$f":"IF(평가_자유!F9=\"\",\"\",평가_자유!F9)","v":"B"},{"$f":"IF(평가_자유!G9=\"\",\"\",평가_자유!G9)","v":"B"},{"$f":"IF(평가_자유!H9=\"\",\"\",평가_자유!H9)","v":"C"},{"$f":"IF(평가_자유!I9=\"\",\"\",평가_자유!I9)","v":"A"},{"$f":"IF(평가_자유!J9=\"\",\"\",평가_자유!J9)","v":""},{"$f":"IF(평가_자유!K9=\"\",\"\",평가_자유!K9)","v":""}]
[null,null,4,{"$f":"IF(설정!D8=\"\",\"\",설정!D8)","v":"학생 4"},{"$f":"IF(평가_교과!E10=\"\",\"\",평가_교과!E10)","v":"A"},{"$f":"IF(평가_교과!F10=\"\",\"\",평가_교과!F10)","v":"A"},{"$f":"IF(평가_교과!G10=\"\",\"\",평가_교과!G10)","v":"B"},{"$f":"IF(평가_교과!H10=\"\",\"\",평가_교과!H10)","v":"C"},{"$f":"IF(평가_교과!I10=\"\",\"\",평가_교과!I10)","v":""},{"$f":"IF(평가_교과!J10=\"\",\"\",평가_교과!J10)","v":""},{"$f":"IF(평가_교과!K10=\"\",\"\",평가_교과!K10)","v":""},{"$f":"IF(평가_자유!E10=\"\",\"\",평가_자유!E10)","v":""},{"$f":"IF(평가_자유!F10=\"\",\"\",평가_자유!F10)","v":""},{"$f":"IF(평가_자유!G10=\"\",\"\",평가_자유!G10)","v":""},{"$f":"IF(평가_자유!H10=\"\",\"\",평가_자유!H10)","v":""},{"$f":"IF(평가_자유!I10=\"\",\"\",평가_자유!I10)","v":""},{"$f":"IF(평가_자유!J10=\"\",\"\",평가_자유!J10)","v":""},{"$f":"IF(평가_자유!K10=\"\",\"\",평가_자유!K10)","v":""}]
[null,null,5,{"$f":"IF(설정!D9=\"\",\"\",설정!D9)","v":"학생 5"},{"$f":"IF(평가_교과!E11=\"\",\"\",평가_교과!E11)","v":"B"},{"$f":"IF(평가_교과!F11=\"\",\"\",평가_교과!F11)","v":"A"},{"$f":"IF(평가_교과!G11=\"\",\"\",평가_교과!G11)","v":"A"},{"$f":"IF(평가_교과!H11=\"\",\"\",평가_교과!H11)","v":"A"},{"$f":"IF(평가_교과!I11=\"\",\"\",평가_교과!I11)","v":""},{"$f":"IF(평가_교과!J11=\"\",\"\",평가_교과!J11)","v":""},{"$f":"IF(평가_교과!K11=\"\",\"\",평가_교과!K11)","v":""},{"$f":"IF(평가_자유!E11=\"\",\"\",평가_자유!E11)","v":"A"},{"$f":"IF(평가_자유!F11=\"\",\"\",평가_자유!F11)","v":"A"},{"$f":"IF(평가_자유!G11=\"\",\"\",평가_자유!G11)","v":"B"},{"$f":"IF(평가_자유!H11=\"\",\"\",평가_자유!H11)","v":"C"},{"$f":"IF(평가_자유!I11=\"\",\"\",평가_자유!I11)","v":"A"},{"$f":"IF(평가_자유!J11=\"\",\"\",평가_자유!J11)","v":""},{"$f":"IF(평가_자유!K11=\"\",\"\",평가_자유!K11)","v":""}]
[null,null,6,{"$f":"IF(설정!D10=\"\",\"\",설정!D10)","v":"학생 6"},{"$f":"IF(평가_교과!E12=\"\",\"\",평가_교과!E12)","v":"C"},{"$f":"IF(평가_교과!F12=\"\",\"\",평가_교과!F12)","v":"A"},{"$f":"IF(평가_교과!G12=\"\",\"\",평가_교과!G12)","v":"B"},{"$f":"IF(평가_교과!H12=\"\",\"\",평가_교과!H12)","v":"B"},{"$f":"IF(평가_교과!I12=\"\",\"\",평가_교과!I12)","v":""},{"$f":"IF(평가_교과!J12=\"\",\"\",평가_교과!J12)","v":""},{"$f":"IF(평가_교과!K12=\"\",\"\",평가_교과!K12)","v":""},{"$f":"IF(평가_자유!E12=\"\",\"\",평가_자유!E12)","v":"B"},{"$f":"IF(평가_자유!F12=\"\",\"\",평가_자유!F12)","v":"C"},{"$f":"IF(평가_자유!G12=\"\",\"\",평가_자유!G12)","v":"B"},{"$f":"IF(평가_자유!H12=\"\",\"\",평가_자유!H12)","v":"A"},{"$f":"IF(평가_자유!I12=\"\",\"\",평가_자유!I12)","v":"A"},{"$f":"IF(평가_자유!J12=\"\",\"\",평가_자유!J12)","v":""},{"$f":"IF(평가_자유!K12=\"\",\"\",평가_자유!K12)","v":""}]
[null,null,7,{"$f":"IF(설정!D11=\"\",\"\",설정!D11)","v":"학생 7"},{"$f":"IF(평가_교과!E13=\"\",\"\",평가_교과!E13)","v":"A"},{"$f":"IF(평가_교과!F13=\"\",\"\",평가_교과!F13)","v":"B"},{"$f":"IF(평가_교과!G13=\"\",\"\",평가_교과!G13)","v":"B"},{"$f":"IF(평가_교과!H13=\"\",\"\",평가_교과!H13)","v":"C"},{"$f":"IF(평가_교과!I13=\"\",\"\",평가_교과!I13)","v":""},{"$f":"IF(평가_교과!J13=\"\",\"\",평가_교과!J13)","v":""},{"$f":"IF(평가_교과!K13=\"\",\"\",평가_교과!K13)","v":""},{"$f":"IF(평가_자유!E13=\"\",\"\",평가_자유!E13)","v":"B"},{"$f":"IF(평가_자유!F13=\"\",\"\",평가_자유!F13)","v":"A"},{"$f":"IF(평가_자유!G13=\"\",\"\",평가_자유!G13)","v":"B"},{"$f":"IF(평가_자유!H13=\"\",\"\",평가_자유!H13)","v":"B"},{"$f":"IF(평가_자유!I13=\"\",\"\",평가_자유!I13)","v":"A"},{"$f":"IF(평가_자유!J13=\"\",\"\",평가_자유!J13)","v":""},{"$f":"IF(평가_자유!K13=\"\",\"\",평가_자유!K13)","v":""}]
[null,null,8,{"$f":"IF(설정!D12=\"\",\"\",설정!D12)","v":"학생 8"},{"$f":"IF(평가_교과!E14=\"\",\"\",평가_교과!E14)","v":"B"},{"$f":"IF(평가_교과!F14=\"\",\"\",평가_교과!F14)","v":"A"},{"$f":"IF(평가_교과!G14=\"\",\"\",평가_교과!G14)","v":"C"},{"$f":"IF(평가_교과!H14=\"\",\"\",평가_교과!H14)","v":"A"},{"$f":"IF(평가_교과!I14=\"\",\"\",평가_교과!I14)","v":""},{"$f":"IF(평가_교과!J14=\"\",\"\",평가_교과!J14)","v":""},{"$f":"IF(평가_교과!K14=\"\",\"\",평가_교과!K14)","v":""},{"$f":"IF(평가_자유!E14=\"\",\"\",평가_자유!E14)","v":"A"},{"$f":"IF(평가_자유!F14=\"\",\"\",평가_자유!F14)","v":"B"},{"$f":"IF(평가_자유!G14=\"\",\"\",평가_자유!G14)","v":"B"},{"$f":"IF(평가_자유!H14=\"\",\"\",평가_자유!H14)","v":"C"},{"$f":"IF(평가_자유!I14=\"\",\"\",평가_자유!I14)","v":"B"},{"$f":"IF(평가_자유!J14=\"\",\"\",평가_자유!J14)","v":""},{"$f":"IF(평가_자유!K14=\"\",\"\",평가_자유!K14)","v":""}]
[null,null,9,{"$f":"IF(설정!D13=\"\",\"\",설정!D13)","v":"학생 9"},{"$f":"IF(평가_교과!E15=\"\",\"\",평가_교과!E15)","v":"A"},{"$f":"IF(평가_교과!F15=\"\",\"\",평가_교과!F15)","v":"B"},{"$f":"IF(평가_교과!G15=\"\",\"\",평가_교과!G15)","v":"A"},{"$f":"IF(평가_교과!H15=\"\",\"\",평가_교과!H15)","v":"C"},{"$f":"IF(평가_교과!I15=\"\",\"\",평가_교과!I15)","v":""},{"$f":"IF(평가_교과!J15=\"\",\"\",평가_교과!J15)","v":""},{"$f":"IF(평가_교과!K15=\"\",\"\",평가_교과!K15)","v":""},{"$f":"IF(평가_자유!E15=\"\",\"\",평가_자유!E15)","v":""},{"$f":"IF(평가_자유!F15=\"\",\"\",평가_자유!F15)","v":""},{"$f":"IF(평가_자유!G15=\"\",\"\",평가_자유!G15)","v":""},{"$f":"IF(평가_자유!H15=\"\",\"\",평가_자유!H15)","v":""},{"$f":"IF(평가_자유!I15=\"\",\"\",평가_자유!I15)","v":""},{"$f":"IF(평가_자유!J15=\"\",\"\",평가_자유!J15)","v":""},{"$f":"IF(평가_자유!K15=\"\",\"\",평가_자유!K15)","v":""}]
[null,null,10,{"$f":"IF(설정!D14=\"\",\"\",설정!D14)","v":"학생10"},{"$f":"IF(평가_교과!E16=\"\",\"\",평가_교과!E16)","v":"C"},{"$f":"IF(평가_교과!F16=\"\",\"\",평가_교과!F16)","v":"B"},{"$f":"IF(평가_교과!G16=\"\",\"\",평가_교과!G16)","v":"A"},{"$f":"IF(평가_교과!H16=\"\",\"\",평가_교과!H16)","v":"B"},{"$f":"IF(평가_교과!I16=\"\",\"\",평가_교과!I16)","v":""},{"$f":"IF(평가_교과!J16=\"\",\"\",평가_교과!J16)","v":""},{"$f":"IF(평가_교과!K16=\"\",\"\",평가_교과!K16)","v":""},{"$f":"IF(평가_자유!E16=\"\",\"\",평가_자유!E16)","v":""},{"$f":"IF(평가_자유!F16=\"\",\"\",평가_자유!F16)","v":""},{"$f":"IF(평가_자유!G16=\"\",\"\",평가_자유!G16)","v":""},{"$f":"IF(평가_자유!H16=\"\",\"\",평가_자유!H16)","v":""},{"$f":"IF(평가_자유!I16=\"\",\"\",평가_자유!I16)","v":""},{"$f":"IF(평가_자유!J16=\"\",\"\",평가_자유!J16)","v":""},{"$f":"IF(평가_자유!K16=\"\",\"\",평가_자유!K16)","v":""}]
[null,null,11,{"$f":"IF(설정!D15=\"\",\"\",설정!D15)","v":"학생11"},{"$f":"IF(평가_교과!E17=\"\",\"\",평가_교과!E17)","v":"B"},{"$f":"IF(평가_교과!F17=\"\",\"\",평가_교과!F17)","v":"A"},{"$f":"IF(평가_교과!G17=\"\",\"\",평가_교과!G17)","v":"B"},{"$f":"IF(평가_교과!H17=\"\",\"\",평가_교과!H17)","v":"C"},{"$f":"IF(평가_교과!I17=\"\",\"\",평가_교과!I17)","v":""},{"$f":"IF(평가_교과!J17=\"\",\"\",평가_교과!J17)","v":""},{"$f":"IF(평가_교과!K17=\"\",\"\",평가_교과!K17)","v":""},{"$f":"IF(평가_자유!E17=\"\",\"\",평가_자유!E17)","v":"A"},{"$f":"IF(평가_자유!F17=\"\",\"\",평가_자유!F17)","v":"A"},{"$f":"IF(평가_자유!G17=\"\",\"\",평가_자유!G17)","v":"A"},{"$f":"IF(평가_자유!H17=\"\",\"\",평가_자유!H17)","v":"B"},{"$f":"IF(평가_자유!I17=\"\",\"\",평가_자유!I17)","v":"B"},{"$f":"IF(평가_자유!J17=\"\",\"\",평가_자유!J17)","v":""},{"$f":"IF(평가_자유!K17=\"\",\"\",평가_자유!K17)","v":""}]
[null,null,12,{"$f":"IF(설정!D16=\"\",\"\",설정!D16)","v":"학생12"},{"$f":"IF(평가_교과!E18=\"\",\"\",평가_교과!E18)","v":"B"},{"$f":"IF(평가_교과!F18=\"\",\"\",평가_교과!F18)","v":"C"},{"$f":"IF(평가_교과!G18=\"\",\"\",평가_교과!G18)","v":"B"},{"$f":"IF(평가_교과!H18=\"\",\"\",평가_교과!H18)","v":"A"},{"$f":"IF(평가_교과!I18=\"\",\"\",평가_교과!I18)","v":""},{"$f":"IF(평가_교과!J18=\"\",\"\",평가_교과!J18)","v":""},{"$f":"IF(평가_교과!K18=\"\",\"\",평가_교과!K18)","v":""},{"$f":"IF(평가_자유!E18=\"\",\"\",평가_자유!E18)","v":""},{"$f":"IF(평가_자유!F18=\"\",\"\",평가_자유!F18)","v":""},{"$f":"IF(평가_자유!G18=\"\",\"\",평가_자유!G18)","v":""},{"$f":"IF(평가_자유!H18=\"\",\"\",평가_자유!H18)","v":""},{"$f":"IF(평가_자유!I18=\"\",\"\",평가_자유!I18)","v":""},{"$f":"IF(평가_자유!J18=\"\",\"\",평가_자유!J18)","v":""},{"$f":"IF(평가_자유!K18=\"\",\"\",평가_자유!K18)","v":""}]
[null,null,13,{"$f":"IF(설정!D17=\"\",\"\",설정!D17)","v":"학생13"},{"$f":"IF(평가_교과!E19=\"\",\"\",평가_교과!E19)","v":"C"},{"$f":"IF(평가_교과!F19=\"\",\"\",평가_교과!F19)","v":"C"},{"$f":"IF(평가_교과!G19=\"\",\"\",평가_교과!G19)","v":"C"},{"$f":"IF(평가_교과!H19=\"\",\"\",평가_교과!H19)","v":"B"},{"$f":"IF(평가_교과!I19=\"\",\"\",평가_교과!I19)","v":""},{"$f":"IF(평가_교과!J19=\"\",\"\",평가_교과!J19)","v":""},{"$f":"IF(평가_교과!K19=\"\",\"\",평가_교과!K19)","v":""},{"$f":"IF(평가_자유!E19=\"\",\"\",평가_자유!E19)","v":"B"},{"$f":"IF(평가_자유!F19=\"\",\"\",평가_자유!F19)","v":"C"},{"$f":"IF(평가_자유!G19=\"\",\"\",평가_자유!G19)","v":"B"},{"$f":"IF(평가_자유!H19=\"\",\"\",평가_자유!H19)","v":"A"},{"$f":"IF(평가_자유!I19=\"\",\"\",평가_자유!I19)","v":"A"},{"$f":"IF(평가_자유!J19=\"\",\"\",평가_자유!J19)","v":""},{"$f":"IF(평가_자유!K19=\"\",\"\",평가_자유!K19)","v":""}]
[null,null,14,{"$f":"IF(설정!D18=\"\",\"\",설정!D18)","v":"학생14"},{"$f":"IF(평가_교과!E20=\"\",\"\",평가_교과!E20)","v":"A"},{"$f":"IF(평가_교과!F20=\"\",\"\",평가_교과!F20)","v":"B"},{"$f":"IF(평가_교과!G20=\"\",\"\",평가_교과!G20)","v":"A"},{"$f":"IF(평가_교과!H20=\"\",\"\",평가_교과!H20)","v":"C"},{"$f":"IF(평가_교과!I20=\"\",\"\",평가_교과!I20)","v":""},{"$f":"IF(평가_교과!J20=\"\",\"\",평가_교과!J20)","v":""},{"$f":"IF(평가_교과!K20=\"\",\"\",평가_교과!K20)","v":""},{"$f":"IF(평가_자유!E20=\"\",\"\",평가_자유!E20)","v":""},{"$f":"IF(평가_자유!F20=\"\",\"\",평가_자유!F20)","v":""},{"$f":"IF(평가_자유!G20=\"\",\"\",평가_자유!G20)","v":""},{"$f":"IF(평가_자유!H20=\"\",\"\",평가_자유!H20)","v":""},{"$f":"IF(평가_자유!I20=\"\",\"\",평가_자유!I20)","v":""},{"$f":"IF(평가_자유!J20=\"\",\"\",평가_자유!J20)","v":""},{"$f":"IF(평가_자유!K20=\"\",\"\",평가_자유!K20)","v":""}]
[null,null,15,{"$f":"IF(설정!D19=\"\",\"\",설정!D19)","v":"학생15"},{"$f":"IF(평가_교과!E21=\"\",\"\",평가_교과!E21)","v":"A"},{"$f":"IF(평가_교과!F21=\"\",\"\",평가_교과!F21)","v":"A"},{"$f":"IF(평가_교과!G21=\"\",\"\",평가_교과!G21)","v":"C"},{"$f":"IF(평가_교과!H21=\"\",\"\",평가_교과!H21)","v":"B"},{"$f":"IF(평가_교과!I21=\"\",\"\",평가_교과!I21)","v":""},{"$f":"IF(평가_교과!J21=\"\",\"\",평가_교과!J21)","v":""},{"$f":"IF(평가_교과!K21=\"\",\"\",평가_교과!K21)","v":""},{"$f":"IF(평가_자유!E21=\"\",\"\",평가_자유!E21)","v":""},{"$f":"IF(평가_자유!F21=\"\",\"\",평가_자유!F21)","v":""},{"$f":"IF(평가_자유!G21=\"\",\"\",평가_자유!G21)","v":""},{"$f":"IF(평가_자유!H21=\"\",\"\",평가_자유!H21)","v":""},{"$f":"IF(평가_자유!I21=\"\",\"\",평가_자유!I21)","v":""},{"$f":"IF(평가_자유!J21=\"\",\"\",평가_자유!J21)","v":""},{"$f":"IF(평가_자유!K21=\"\",\"\",평가_자유!K21)","v":""}]
[null,null,16,{"$f":"IF(설정!D20=\"\",\"\",설정!D20)","v":"학생16"},{"$f":"IF(평가_교과!E22=\"\",\"\",평가_교과!E22)","v":"B"},{"$f":"IF(평가_교과!F22=\"\",\"\",평가_교과!F22)","v":"B"},{"$f":"IF(평가_교과!G22=\"\",\"\",평가_교과!G22)","v":"A"},{"$f":"IF(평가_교과!H22=\"\",\"\",평가_교과!H22)","v":"전출"},{"$f":"IF(평가_교과!I22=\"\",\"\",평가_교과!I22)","v":""},{"$f":"IF(평가_교과!J22=\"\",\"\",평가_교과!J22)","v":""},{"$f":"IF(평가_교과!K22=\"\",\"\",평가_교과!K22)","v":""},{"$f":"IF(평가_자유!E22=\"\",\"\",평가_자유!E22)","v":"B"},{"$f":"IF(평가_자유!F22=\"\",\"\",평가_자유!F22)","v":"B"},{"$f":"IF(평가_자유!G22=\"\",\"\",평가_자유!G22)","v":"A"},{"$f":"IF(평가_자유!H22=\"\",\"\",평가_자유!H22)","v":"C"},{"$f":"IF(평가_자유!I22=\"\",\"\",평가_자유!I22)","v":"전출"},{"$f":"IF(평가_자유!J22=\"\",\"\",평가_자유!J22)","v":""},{"$f":"IF(평가_자유!K22=\"\",\"\",평가_자유!K22)","v":""}]
[null,null,17,{"$f":"IF(설정!D21=\"\",\"\",설정!D21)","v":"학생17"},{"$f":"IF(평가_교과!E23=\"\",\"\",평가_교과!E23)","v":"B"},{"$f":"IF(평가_교과!F23=\"\",\"\",평가_교과!F23)","v":"C"},{"$f":"IF(평가_교과!G23=\"\",\"\",평가_교과!G23)","v":"A"},{"$f":"IF(평가_교과!H23=\"\",\"\",평가_교과!H23)","v":"B"},{"$f":"IF(평가_교과!I23=\"\",\"\",평가_교과!I23)","v":""},{"$f":"IF(평가_교과!J23=\"\",\"\",평가_교과!J23)","v":""},{"$f":"IF(평가_교과!K23=\"\",\"\",평가_교과!K23)","v":""},{"$f":"IF(평가_자유!E23=\"\",\"\",평가_자유!E23)","v":"C"},{"$f":"IF(평가_자유!F23=\"\",\"\",평가_자유!F23)","v":"B"},{"$f":"IF(평가_자유!G23=\"\",\"\",평가_자유!G23)","v":"C"},{"$f":"IF(평가_자유!H23=\"\",\"\",평가_자유!H23)","v":"B"},{"$f":"IF(평가_자유!I23=\"\",\"\",평가_자유!I23)","v":"A"},{"$f":"IF(평가_자유!J23=\"\",\"\",평가_자유!J23)","v":""},{"$f":"IF(평가_자유!K23=\"\",\"\",평가_자유!K23)","v":""}]
[null,null,18,{"$f":"IF(설정!D22=\"\",\"\",설정!D22)","v":"학생18"},{"$f":"IF(평가_교과!E24=\"\",\"\",평가_교과!E24)","v":"A"},{"$f":"IF(평가_교과!F24=\"\",\"\",평가_교과!F24)","v":"A"},{"$f":"IF(평가_교과!G24=\"\",\"\",평가_교과!G24)","v":"B"},{"$f":"IF(평가_교과!H24=\"\",\"\",평가_교과!H24)","v":"A"},{"$f":"IF(평가_교과!I24=\"\",\"\",평가_교과!I24)","v":""},{"$f":"IF(평가_교과!J24=\"\",\"\",평가_교과!J24)","v":""},{"$f":"IF(평가_교과!K24=\"\",\"\",평가_교과!K24)","v":""},{"$f":"IF(평가_자유!E24=\"\",\"\",평가_자유!E24)","v":"A"},{"$f":"IF(평가_자유!F24=\"\",\"\",평가_자유!F24)","v":"A"},{"$f":"IF(평가_자유!G24=\"\",\"\",평가_자유!G24)","v":"A"},{"$f":"IF(평가_자유!H24=\"\",\"\",평가_자유!H24)","v":"B"},{"$f":"IF(평가_자유!I24=\"\",\"\",평가_자유!I24)","v":"B"},{"$f":"IF(평가_자유!J24=\"\",\"\",평가_자유!J24)","v":""},{"$f":"IF(평가_자유!K24=\"\",\"\",평가_자유!K24)","v":""}]
[null,null,19,{"$f":"IF(설정!D23=\"\",\"\",설정!D23)","v":"학생19"},{"$f":"IF(평가_교과!E25=\"\",\"\",평가_교과!E25)","v":"A"},{"$f":"IF(평가_교과!F25=\"\",\"\",평가_교과!F25)","v":"B"},{"$f":"IF(평가_교과!G25=\"\",\"\",평가_교과!G25)","v":"C"},{"$f":"IF(평가_교과!H25=\"\",\"\",평가_교과!H25)","v":"C"},{"$f":"IF(평가_교과!I25=\"\",\"\",평가_교과!I25)","v":""},{"$f":"IF(평가_교과!J25=\"\",\"\",평가_교과!J25)","v":""},{"$f":"IF(평가_교과!K25=\"\",\"\",평가_교과!K25)","v":""},{"$f":"IF(평가_자유!E25=\"\",\"\",평가_자유!E25)","v":""},{"$f":"IF(평가_자유!F25=\"\",\"\",평가_자유!F25)","v":""},{"$f":"IF(평가_자유!G25=\"\",\"\",평가_자유!G25)","v":""},{"$f":"IF(평가_자유!H25=\"\",\"\",평가_자유!H25)","v":""},{"$f":"IF(평가_자유!I25=\"\",\"\",평가_자유!I25)","v":""},{"$f":"IF(평가_자유!J25=\"\",\"\",평가_자유!J25)","v":""},{"$f":"IF(평가_자유!K25=\"\",\"\",평가_자유!K25)","v":""}]
[null,null,20,{"$f":"IF(설정!D24=\"\",\"\",설정!D24)","v":"학생20"},{"$f":"IF(평가_교과!E26=\"\",\"\",평가_교과!E26)","v":"B"},{"$f":"IF(평가_교과!F26=\"\",\"\",평가_교과!F26)","v":"B"},{"$f":"IF(평가_교과!G26=\"\",\"\",평가_교과!G26)","v":"A"},{"$f":"IF(평가_교과!H26=\"\",\"\",평가_교과!H26)","v":"A"},{"$f":"IF(평가_교과!I26=\"\",\"\",평가_교과!I26)","v":""},{"$f":"IF(평가_교과!J26=\"\",\"\",평가_교과!J26)","v":""},{"$f":"IF(평가_교과!K26=\"\",\"\",평가_교과!K26)","v":""},{"$f":"IF(평가_자유!E26=\"\",\"\",평가_자유!E26)","v":""},{"$f":"IF(평가_자유!F26=\"\",\"\",평가_자유!F26)","v":""},{"$f":"IF(평가_자유!G26=\"\",\"\",평가_자유!G26)","v":""},{"$f":"IF(평가_자유!H26=\"\",\"\",평가_자유!H26)","v":""},{"$f":"IF(평가_자유!I26=\"\",\"\",평가_자유!I26)","v":""},{"$f":"IF(평가_자유!J26=\"\",\"\",평가_자유!J26)","v":""},{"$f":"IF(평가_자유!K26=\"\",\"\",평가_자유!K26)","v":""}]
[null,null,21,{"$f":"IF(설정!D25=\"\",\"\",설정!D25)","v":"학생21"},{"$f":"IF(평가_교과!E27=\"\",\"\",평가_교과!E27)","v":"A"},{"$f":"IF(평가_교과!F27=\"\",\"\",평가_교과!F27)","v":"A"},{"$f":"IF(평가_교과!G27=\"\",\"\",평가_교과!G27)","v":"B"},{"$f":"IF(평가_교과!H27=\"\",\"\",평가_교과!H27)","v":"A"},{"$f":"IF(평가_교과!I27=\"\",\"\",평가_교과!I27)","v":""},{"$f":"IF(평가_교과!J27=\"\",\"\",평가_교과!J27)","v":""},{"$f":"IF(평가_교과!K27=\"\",\"\",평가_교과!K27)","v":""},{"$f":"IF(평가_자유!E27=\"\",\"\",평가_자유!E27)","v":"A"},{"$f":"IF(평가_자유!F27=\"\",\"\",평가_자유!F27)","v":"B"},{"$f":"IF(평가_자유!G27=\"\",\"\",평가_자유!G27)","v":"B"},{"$f":"IF(평가_자유!H27=\"\",\"\",평가_자유!H27)","v":"C"},{"$f":"IF(평가_자유!I27=\"\",\"\",평가_자유!I27)","v":"B"},{"$f":"IF(평가_자유!J27=\"\",\"\",평가_자유!J27)","v":""},{"$f":"IF(평가_자유!K27=\"\",\"\",평가_자유!K27)","v":""}]
[null,null,22,{"$f":"IF(설정!D26=\"\",\"\",설정!D26)","v":"학생22"},{"$f":"IF(평가_교과!E28=\"\",\"\",평가_교과!E28)","v":"B"},{"$f":"IF(평가_교과!F28=\"\",\"\",평가_교과!F28)","v":"A"},{"$f":"IF(평가_교과!G28=\"\",\"\",평가_교과!G28)","v":"C"},{"$f":"IF(평가_교과!H28=\"\",\"\",평가_교과!H28)","v":"B"},{"$f":"IF(평가_교과!I28=\"\",\"\",평가_교과!I28)","v":""},{"$f":"IF(평가_교과!J28=\"\",\"\",평가_교과!J28)","v":""},{"$f":"IF(평가_교과!K28=\"\",\"\",평가_교과!K28)","v":""},{"$f":"IF(평가_자유!E28=\"\",\"\",평가_자유!E28)","v":""},{"$f":"IF(평가_자유!F28=\"\",\"\",평가_자유!F28)","v":""},{"$f":"IF(평가_자유!G28=\"\",\"\",평가_자유!G28)","v":""},{"$f":"IF(평가_자유!H28=\"\",\"\",평가_자유!H28)","v":""},{"$f":"IF(평가_자유!I28=\"\",\"\",평가_자유!I28)","v":""},{"$f":"IF(평가_자유!J28=\"\",\"\",평가_자유!J28)","v":""},{"$f":"IF(평가_자유!K28=\"\",\"\",평가_자유!K28)","v":""}]
[null,null,23,{"$f":"IF(설정!D27=\"\",\"\",설정!D27)","v":"학생23"},{"$f":"IF(평가_교과!E29=\"\",\"\",평가_교과!E29)","v":"A"},{"$f":"IF(평가_교과!F29=\"\",\"\",평가_교과!F29)","v":"A"},{"$f":"IF(평가_교과!G29=\"\",\"\",평가_교과!G29)","v":"A"},{"$f":"IF(평가_교과!H29=\"\",\"\",평가_교과!H29)","v":"B"},{"$f":"IF(평가_교과!I29=\"\",\"\",평가_교과!I29)","v":""},{"$f":"IF(평가_교과!J29=\"\",\"\",평가_교과!J29)","v":""},{"$f":"IF(평가_교과!K29=\"\",\"\",평가_교과!K29)","v":""},{"$f":"IF(평가_자유!E29=\"\",\"\",평가_자유!E29)","v":"C"},{"$f":"IF(평가_자유!F29=\"\",\"\",평가_자유!F29)","v":"B"},{"$f":"IF(평가_자유!G29=\"\",\"\",평가_자유!G29)","v":"C"},{"$f":"IF(평가_자유!H29=\"\",\"\",평가_자유!H29)","v":"C"},{"$f":"IF(평가_자유!I29=\"\",\"\",평가_자유!I29)","v":"B"},{"$f":"IF(평가_자유!J29=\"\",\"\",평가_자유!J29)","v":""},{"$f":"IF(평가_자유!K29=\"\",\"\",평가_자유!K29)","v":""}]
[null,null,24,{"$f":"IF(설정!D28=\"\",\"\",설정!D28)","v":"학생24"},{"$f":"IF(평가_교과!E30=\"\",\"\",평가_교과!E30)","v":"A"},{"$f":"IF(평가_교과!F30=\"\",\"\",평가_교과!F30)","v":"A"},{"$f":"IF(평가_교과!G30=\"\",\"\",평가_교과!G30)","v":"A"},{"$f":"IF(평가_교과!H30=\"\",\"\",평가_교과!H30)","v":"A"},{"$f":"IF(평가_교과!I30=\"\",\"\",평가_교과!I30)","v":""},{"$f":"IF(평가_교과!J30=\"\",\"\",평가_교과!J30)","v":""},{"$f":"IF(평가_교과!K30=\"\",\"\",평가_교과!K30)","v":""},{"$f":"IF(평가_자유!E30=\"\",\"\",평가_자유!E30)","v":""},{"$f":"IF(평가_자유!F30=\"\",\"\",평가_자유!F30)","v":""},{"$f":"IF(평가_자유!G30=\"\",\"\",평가_자유!G30)","v":""},{"$f":"IF(평가_자유!H30=\"\",\"\",평가_자유!H30)","v":""},{"$f":"IF(평가_자유!I30=\"\",\"\",평가_자유!I30)","v":""},{"$f":"IF(평가_자유!J30=\"\",\"\",평가_자유!J30)","v":""},{"$f":"IF(평가_자유!K30=\"\",\"\",평가_자유!K30)","v":""}]
[null,null,25,{"$f":"IF(설정!D29=\"\",\"\",설정!D29)","v":"학생25"},{"$f":"IF(평가_교과!E31=\"\",\"\",평가_교과!E31)","v":"전입"},{"$f":"IF(평가_교과!F31=\"\",\"\",평가_교과!F31)","v":"B"},{"$f":"IF(평가_교과!G31=\"\",\"\",평가_교과!G31)","v":"C"},{"$f":"IF(평가_교과!H31=\"\",\"\",평가_교과!H31)","v":"B"},{"$f":"IF(평가_교과!I31=\"\",\"\",평가_교과!I31)","v":""},{"$f":"IF(평가_교과!J31=\"\",\"\",평가_교과!J31)","v":""},{"$f":"IF(평가_교과!K31=\"\",\"\",평가_교과!K31)","v":""},{"$f":"IF(평가_자유!E31=\"\",\"\",평가_자유!E31)","v":"전입"},{"$f":"IF(평가_자유!F31=\"\",\"\",평가_자유!F31)","v":"A"},{"$f":"IF(평가_자유!G31=\"\",\"\",평가_자유!G31)","v":"B"},{"$f":"IF(평가_자유!H31=\"\",\"\",평가_자유!H31)","v":"A"},{"$f":"IF(평가_자유!I31=\"\",\"\",평가_자유!I31)","v":"A"},{"$f":"IF(평가_자유!J31=\"\",\"\",평가_자유!J31)","v":""},{"$f":"IF(평가_자유!K31=\"\",\"\",평가_자유!K31)","v":""}]
[null,null,26,{"$f":"IF(설정!D30=\"\",\"\",설정!D30)","v":""},{"$f":"IF(평가_교과!E32=\"\",\"\",평가_교과!E32)","v":""},{"$f":"IF(평가_교과!F32=\"\",\"\",평가_교과!F32)","v":""},{"$f":"IF(평가_교과!G32=\"\",\"\",평가_교과!G32)","v":""},{"$f":"IF(평가_교과!H32=\"\",\"\",평가_교과!H32)","v":""},{"$f":"IF(평가_교과!I32=\"\",\"\",평가_교과!I32)","v":""},{"$f":"IF(평가_교과!J32=\"\",\"\",평가_교과!J32)","v":""},{"$f":"IF(평가_교과!K32=\"\",\"\",평가_교과!K32)","v":""},{"$f":"IF(평가_자유!E32=\"\",\"\",평가_자유!E32)","v":""},{"$f":"IF(평가_자유!F32=\"\",\"\",평가_자유!F32)","v":""},{"$f":"IF(평가_자유!G32=\"\",\"\",평가_자유!G32)","v":""},{"$f":"IF(평가_자유!H32=\"\",\"\",평가_자유!H32)","v":""},{"$f":"IF(평가_자유!I32=\"\",\"\",평가_자유!I32)","v":""},{"$f":"IF(평가_자유!J32=\"\",\"\",평가_자유!J32)","v":""},{"$f":"IF(평가_자유!K32=\"\",\"\",평가_자유!K32)","v":""}]
[null,null,27,{"$f":"IF(설정!D31=\"\",\"\",설정!D31)","v":""},{"$f":"IF(평가_교과!E33=\"\",\"\",평가_교과!E33)","v":""},{"$f":"IF(평가_교과!F33=\"\",\"\",평가_교과!F33)","v":""},{"$f":"IF(평가_교과!G33=\"\",\"\",평가_교과!G33)","v":""},{"$f":"IF(평가_교과!H33=\"\",\"\",평가_교과!H33)","v":""},{"$f":"IF(평가_교과!I33=\"\",\"\",평가_교과!I33)","v":""},{"$f":"IF(평가_교과!J33=\"\",\"\",평가_교과!J33)","v":""},{"$f":"IF(평가_교과!K33=\"\",\"\",평가_교과!K33)","v":""},{"$f":"IF(평가_자유!E33=\"\",\"\",평가_자유!E33)","v":""},{"$f":"IF(평가_자유!F33=\"\",\"\",평가_자유!F33)","v":""},{"$f":"IF(평가_자유!G33=\"\",\"\",평가_자유!G33)","v":""},{"$f":"IF(평가_자유!H33=\"\",\"\",평가_자유!H33)","v":""},{"$f":"IF(평가_자유!I33=\"\",\"\",평가_자유!I33)","v":""},{"$f":"IF(평가_자유!J33=\"\",\"\",평가_자유!J33)","v":""},{"$f":"IF(평가_자유!K33=\"\",\"\",평가_자유!K33)","v":""}]
[null,null,28,{"$f":"IF(설정!D32=\"\",\"\",설정!D32)","v":""},{"$f":"IF(평가_교과!E34=\"\",\"\",평가_교과!E34)","v":""},{"$f":"IF(평가_교과!F34=\"\",\"\",평가_교과!F34)","v":""},{"$f":"IF(평가_교과!G34=\"\",\"\",평가_교과!G34)","v":""},{"$f":"IF(평가_교과!H34=\"\",\"\",평가_교과!H34)","v":""},{"$f":"IF(평가_교과!I34=\"\",\"\",평가_교과!I34)","v":""},{"$f":"IF(평가_교과!J34=\"\",\"\",평가_교과!J34)","v":""},{"$f":"IF(평가_교과!K34=\"\",\"\",평가_교과!K34)","v":""},{"$f":"IF(평가_자유!E34=\"\",\"\",평가_자유!E34)","v":""},{"$f":"IF(평가_자유!F34=\"\",\"\",평가_자유!F34)","v":""},{"$f":"IF(평가_자유!G34=\"\",\"\",평가_자유!G34)","v":""},{"$f":"IF(평가_자유!H34=\"\",\"\",평가_자유!H34)","v":""},{"$f":"IF(평가_자유!I34=\"\",\"\",평가_자유!I34)","v":""},{"$f":"IF(평가_자유!J34=\"\",\"\",평가_자유!J34)","v":""},{"$f":"IF(평가_자유!K34=\"\",\"\",평가_자유!K34)","v":""}]
[null,null,29,{"$f":"IF(설정!D33=\"\",\"\",설정!D33)","v":""},{"$f":"IF(평가_교과!E35=\"\",\"\",평가_교과!E35)","v":""},{"$f":"IF(평가_교과!F35=\"\",\"\",평가_교과!F35)","v":""},{"$f":"IF(평가_교과!G35=\"\",\"\",평가_교과!G35)","v":""},{"$f":"IF(평가_교과!H35=\"\",\"\",평가_교과!H35)","v":""},{"$f":"IF(평가_교과!I35=\"\",\"\",평가_교과!I35)","v":""},{"$f":"IF(평가_교과!J35=\"\",\"\",평가_교과!J35)","v":""},{"$f":"IF(평가_교과!K35=\"\",\"\",평가_교과!K35)","v":""},{"$f":"IF(평가_자유!E35=\"\",\"\",평가_자유!E35)","v":""},{"$f":"IF(평가_자유!F35=\"\",\"\",평가_자유!F35)","v":""},{"$f":"IF(평가_자유!G35=\"\",\"\",평가_자유!G35)","v":""},{"$f":"IF(평가_자유!H35=\"\",\"\",평가_자유!H35)","v":""},{"$f":"IF(평가_자유!I35=\"\",\"\",평가_자유!I35)","v":""},{"$f":"IF(평가_자유!J35=\"\",\"\",평가_자유!J35)","v":""},{"$f":"IF(평가_자유!K35=\"\",\"\",평가_자유!K35)","v":""}]
[null,null,30,{"$f":"IF(설정!D34=\"\",\"\",설정!D34)","v":""},{"$f":"IF(평가_교과!E36=\"\",\"\",평가_교과!E36)","v":""},{"$f":"IF(평가_교과!F36=\"\",\"\",평가_교과!F36)","v":""},{"$f":"IF(평가_교과!G36=\"\",\"\",평가_교과!G36)","v":""},{"$f":"IF(평가_교과!H36=\"\",\"\",평가_교과!H36)","v":""},{"$f":"IF(평가_교과!I36=\"\",\"\",평가_교과!I36)","v":""},{"$f":"IF(평가_교과!J36=\"\",\"\",평가_교과!J36)","v":""},{"$f":"IF(평가_교과!K36=\"\",\"\",평가_교과!K36)","v":""},{"$f":"IF(평가_자유!E36=\"\",\"\",평가_자유!E36)","v":""},{"$f":"IF(평가_자유!F36=\"\",\"\",평가_자유!F36)","v":""},{"$f":"IF(평가_자유!G36=\"\",\"\",평가_자유!G36)","v":""},{"$f":"IF(평가_자유!H36=\"\",\"\",평가_자유!H36)","v":""},{"$f":"IF(평가_자유!I36=\"\",\"\",평가_자유!I36)","v":""},{"$f":"IF(평가_자유!J36=\"\",\"\",평가_자유!J36)","v":""},{"$f":"IF(평가_자유!K36=\"\",\"\",평가_자유!K36)","v":""}]
[null,null,31,{"$f":"IF(설정!D35=\"\",\"\",설정!D35)","v":""},{"$f":"IF(평가_교과!E37=\"\",\"\",평가_교과!E37)","v":""},{"$f":"IF(평가_교과!F37=\"\",\"\",평가_교과!F37)","v":""},{"$f":"IF(평가_교과!G37=\"\",\"\",평가_교과!G37)","v":""},{"$f":"IF(평가_교과!H37=\"\",\"\",평가_교과!H37)","v":""},{"$f":"IF(평가_교과!I37=\"\",\"\",평가_교과!I37)","v":""},{"$f":"IF(평가_교과!J37=\"\",\"\",평가_교과!J37)","v":""},{"$f":"IF(평가_교과!K37=\"\",\"\",평가_교과!K37)","v":""},{"$f":"IF(평가_자유!E37=\"\",\"\",평가_자유!E37)","v":""},{"$f":"IF(평가_자유!F37=\"\",\"\",평가_자유!F37)","v":""},{"$f":"IF(평가_자유!G37=\"\",\"\",평가_자유!G37)","v":""},{"$f":"IF(평가_자유!H37=\"\",\"\",평가_자유!H37)","v":""},{"$f":"IF(평가_자유!I37=\"\",\"\",평가_자유!I37)","v":""},{"$f":"IF(평가_자유!J37=\"\",\"\",평가_자유!J37)","v":""},{"$f":"IF(평가_자유!K37=\"\",\"\",평가_자유!K37)","v":""}]
[null,null,32,{"$f":"IF(설정!D36=\"\",\"\",설정!D36)","v":""},{"$f":"IF(평가_교과!E38=\"\",\"\",평가_교과!E38)","v":""},{"$f":"IF(평가_교과!F38=\"\",\"\",평가_교과!F38)","v":""},{"$f":"IF(평가_교과!G38=\"\",\"\",평가_교과!G38)","v":""},{"$f":"IF(평가_교과!H38=\"\",\"\",평가_교과!H38)","v":""},{"$f":"IF(평가_교과!I38=\"\",\"\",평가_교과!I38)","v":""},{"$f":"IF(평가_교과!J38=\"\",\"\",평가_교과!J38)","v":""},{"$f":"IF(평가_교과!K38=\"\",\"\",평가_교과!K38)","v":""},{"$f":"IF(평가_자유!E38=\"\",\"\",평가_자유!E38)","v":""},{"$f":"IF(평가_자유!F38=\"\",\"\",평가_자유!F38)","v":""},{"$f":"IF(평가_자유!G38=\"\",\"\",평가_자유!G38)","v":""},{"$f":"IF(평가_자유!H38=\"\",\"\",평가_자유!H38)","v":""},{"$f":"IF(평가_자유!I38=\"\",\"\",평가_자유!I38)","v":""},{"$f":"IF(평가_자유!J38=\"\",\"\",평가_자유!J38)","v":""},{"$f":"IF(평가_자유!K38=\"\",\"\",평가_자유!K38)","v":""}]
[null,null,33,{"$f":"IF(설정!D37=\"\",\"\",설정!D37)","v":""},{"$f":"IF(평가_교과!E39=\"\",\"\",평가_교과!E39)","v":""},{"$f":"IF(평가_교과!F39=\"\",\"\",평가_교과!F39)","v":""},{"$f":"IF(평가_교과!G39=\"\",\"\",평가_교과!G39)","v":""},{"$f":"IF(평가_교과!H39=\"\",\"\",평가_교과!H39)","v":""},{"$f":"IF(평가_교과!I39=\"\",\"\",평가_교과!I39)","v":""},{"$f":"IF(평가_교과!J39=\"\",\"\",평가_교과!J39)","v":""},{"$f":"IF(평가_교과!K39=\"\",\"\",평가_교과!K39)","v":""},{"$f":"IF(평가_자유!E39=\"\",\"\",평가_자유!E39)","v":""},{"$f":"IF(평가_자유!F39=\"\",\"\",평가_자유!F39)","v":""},{"$f":"IF(평가_자유!G39=\"\",\"\",평가_자유!G39)","v":""},{"$f":"IF(평가_자유!H39=\"\",\"\",평가_자유!H39)","v":""},{"$f":"IF(평가_자유!I39=\"\",\"\",평가_자유!I39)","v":""},{"$f":"IF(평가_자유!J39=\"\",\"\",평가_자유!J39)","v":""},{"$f":"IF(평가_자유!K39=\"\",\"\",평가_자유!K39)","v":""}]
[null,null,34,{"$f":"IF(설정!D38=\"\",\"\",설정!D38)","v":""},{"$f":"IF(평가_교과!E40=\"\",\"\",평가_교과!E40)","v":""},{"$f":"IF(평가_교과!F40=\"\",\"\",평가_교과!F40)","v":""},{"$f":"IF(평가_교과!G40=\"\",\"\",평가_교과!G40)","v":""},{"$f":"IF(평가_교과!H40=\"\",\"\",평가_교과!H40)","v":""},{"$f":"IF(평가_교과!I40=\"\",\"\",평가_교과!I40)","v":""},{"$f":"IF(평가_교과!J40=\"\",\"\",평가_교과!J40)","v":""},{"$f":"IF(평가_교과!K40=\"\",\"\",평가_교과!K40)","v":""},{"$f":"IF(평가_자유!E40=\"\",\"\",평가_자유!E40)","v":""},{"$f":"IF(평가_자유!F40=\"\",\"\",평가_자유!F40)","v":""},{"$f":"IF(평가_자유!G40=\"\",\"\",평가_자유!G40)","v":""},{"$f":"IF(평가_자유!H40=\"\",\"\",평가_자유!H40)","v":""},{"$f":"IF(평가_자유!I40=\"\",\"\",평가_자유!I40)","v":""},{"$f":"IF(평가_자유!J40=\"\",\"\",평가_자유!J40)","v":""},{"$f":"IF(평가_자유!K40=\"\",\"\",평가_자유!K40)","v":""}]
[null,null,35,{"$f":"IF(설정!D39=\"\",\"\",설정!D39)","v":""},{"$f":"IF(평가_교과!E41=\"\",\"\",평가_교과!E41)","v":""},{"$f":"IF(평가_교과!F41=\"\",\"\",평가_교과!F41)","v":""},{"$f":"IF(평가_교과!G41=\"\",\"\",평가_교과!G41)","v":""},{"$f":"IF(평가_교과!H41=\"\",\"\",평가_교과!H41)","v":""},{"$f":"IF(평가_교과!I41=\"\",\"\",평가_교과!I41)","v":""},{"$f":"IF(평가_교과!J41=\"\",\"\",평가_교과!J41)","v":""},{"$f":"IF(평가_교과!K41=\"\",\"\",평가_교과!K41)","v":""},{"$f":"IF(평가_자유!E41=\"\",\"\",평가_자유!E41)","v":""},{"$f":"IF(평가_자유!F41=\"\",\"\",평가_자유!F41)","v":""},{"$f":"IF(평가_자유!G41=\"\",\"\",평가_자유!G41)","v":""},{"$f":"IF(평가_자유!H41=\"\",\"\",평가_자유!H41)","v":""},{"$f":"IF(평가_자유!I41=\"\",\"\",평가_자유!I41)","v":""},{"$f":"IF(평가_자유!J41=\"\",\"\",평가_자유!J41)","v":""},{"$f":"IF(평가_자유!K41=\"\",\"\",평가_자유!K41)","v":""}]
[null,null,36,{"$f":"IF(설정!D40=\"\",\"\",설정!D40)","v":""},{"$f":"IF(평가_교과!E42=\"\",\"\",평가_교과!E42)","v":""},{"$f":"IF(평가_교과!F42=\"\",\"\",평가_교과!F42)","v":""},{"$f":"IF(평가_교과!G42=\"\",\"\",평가_교과!G42)","v":""},{"$f":"IF(평가_교과!H42=\"\",\"\",평가_교과!H42)","v":""},{"$f":"IF(평가_교과!I42=\"\",\"\",평가_교과!I42)","v":""},{"$f":"IF(평가_교과!J42=\"\",\"\",평가_교과!J42)","v":""},{"$f":"IF(평가_교과!K42=\"\",\"\",평가_교과!K42)","v":""},{"$f":"IF(평가_자유!E42=\"\",\"\",평가_자유!E42)","v":""},{"$f":"IF(평가_자유!F42=\"\",\"\",평가_자유!F42)","v":""},{"$f":"IF(평가_자유!G42=\"\",\"\",평가_자유!G42)","v":""},{"$f":"IF(평가_자유!H42=\"\",\"\",평가_자유!H42)","v":""},{"$f":"IF(평가_자유!I42=\"\",\"\",평가_자유!I42)","v":""},{"$f":"IF(평가_자유!J42=\"\",\"\",평가_자유!J42)","v":""},{"$f":"IF(평가_자유!K42=\"\",\"\",평가_자유!K42)","v":""}]
[null,null,37,{"$f":"IF(설정!D41=\"\",\"\",설정!D41)","v":""},{"$f":"IF(평가_교과!E43=\"\",\"\",평가_교과!E43)","v":""},{"$f":"IF(평가_교과!F43=\"\",\"\",평가_교과!F43)","v":""},{"$f":"IF(평가_교과!G43=\"\",\"\",평가_교과!G43)","v":""},{"$f":"IF(평가_교과!H43=\"\",\"\",평가_교과!H43)","v":""},{"$f":"IF(평가_교과!I43=\"\",\"\",평가_교과!I43)","v":""},{"$f":"IF(평가_교과!J43=\"\",\"\",평가_교과!J43)","v":""},{"$f":"IF(평가_교과!K43=\"\",\"\",평가_교과!K43)","v":""},{"$f":"IF(평가_자유!E43=\"\",\"\",평가_자유!E43)","v":""},{"$f":"IF(평가_자유!F43=\"\",\"\",평가_자유!F43)","v":""},{"$f":"IF(평가_자유!G43=\"\",\"\",평가_자유!G43)","v":""},{"$f":"IF(평가_자유!H43=\"\",\"\",평가_자유!H43)","v":""},{"$f":"IF(평가_자유!I43=\"\",\"\",평가_자유!I43)","v":""},{"$f":"IF(평가_자유!J43=\"\",\"\",평가_자유!J43)","v":""},{"$f":"IF(평가_자유!K43=\"\",\"\",평가_자유!K43)","v":""}]
[null,null,38,{"$f":"IF(설정!D42=\"\",\"\",설정!D42)","v":""},{"$f":"IF(평가_교과!E44=\"\",\"\",평가_교과!E44)","v":""},{"$f":"IF(평가_교과!F44=\"\",\"\",평가_교과!F44)","v":""},{"$f":"IF(평가_교과!G44=\"\",\"\",평가_교과!G44)","v":""},{"$f":"IF(평가_교과!H44=\"\",\"\",평가_교과!H44)","v":""},{"$f":"IF(평가_교과!I44=\"\",\"\",평가_교과!I44)","v":""},{"$f":"IF(평가_교과!J44=\"\",\"\",평가_교과!J44)","v":""},{"$f":"IF(평가_교과!K44=\"\",\"\",평가_교과!K44)","v":""},{"$f":"IF(평가_자유!E44=\"\",\"\",평가_자유!E44)","v":""},{"$f":"IF(평가_자유!F44=\"\",\"\",평가_자유!F44)","v":""},{"$f":"IF(평가_자유!G44=\"\",\"\",평가_자유!G44)","v":""},{"$f":"IF(평가_자유!H44=\"\",\"\",평가_자유!H44)","v":""},{"$f":"IF(평가_자유!I44=\"\",\"\",평가_자유!I44)","v":""},{"$f":"IF(평가_자유!J44=\"\",\"\",평가_자유!J44)","v":""},{"$f":"IF(평가_자유!K44=\"\",\"\",평가_자유!K44)","v":""}]
[null,null,39,{"$f":"IF(설정!D43=\"\",\"\",설정!D43)","v":""},{"$f":"IF(평가_교과!E45=\"\",\"\",평가_교과!E45)","v":""},{"$f":"IF(평가_교과!F45=\"\",\"\",평가_교과!F45)","v":""},{"$f":"IF(평가_교과!G45=\"\",\"\",평가_교과!G45)","v":""},{"$f":"IF(평가_교과!H45=\"\",\"\",평가_교과!H45)","v":""},{"$f":"IF(평가_교과!I45=\"\",\"\",평가_교과!I45)","v":""},{"$f":"IF(평가_교과!J45=\"\",\"\",평가_교과!J45)","v":""},{"$f":"IF(평가_교과!K45=\"\",\"\",평가_교과!K45)","v":""},{"$f":"IF(평가_자유!E45=\"\",\"\",평가_자유!E45)","v":""},{"$f":"IF(평가_자유!F45=\"\",\"\",평가_자유!F45)","v":""},{"$f":"IF(평가_자유!G45=\"\",\"\",평가_자유!G45)","v":""},{"$f":"IF(평가_자유!H45=\"\",\"\",평가_자유!H45)","v":""},{"$f":"IF(평가_자유!I45=\"\",\"\",평가_자유!I45)","v":""},{"$f":"IF(평가_자유!J45=\"\",\"\",평가_자유!J45)","v":""},{"$f":"IF(평가_자유!K45=\"\",\"\",평가_자유!K45)","v":""}]
[null,null,40,{"$f":"IF(설정!D44=\"\",\"\",설정!D44)","v":""},{"$f":"IF(평가_교과!E46=\"\",\"\",평가_교과!E46)","v":""},{"$f":"IF(평가_교과!F46=\"\",\"\",평가_교과!F46)","v":""},{"$f":"IF(평가_교과!G46=\"\",\"\",평가_교과!G46)","v":""},{"$f":"IF(평가_교과!H46=\"\",\"\",평가_교과!H46)","v":""},{"$f":"IF(평가_교과!I46=\"\",\"\",평가_교과!I46)","v":""},{"$f":"IF(평가_교과!J46=\"\",\"\",평가_교과!J46)","v":""},{"$f":"IF(평가_교과!K46=\"\",\"\",평가_교과!K46)","v":""},{"$f":"IF(평가_자유!E46=\"\",\"\",평가_자유!E46)","v":""},{"$f":"IF(평가_자유!F46=\"\",\"\",평가_자유!F46)","v":""},{"$f":"IF(평가_자유!G46=\"\",\"\",평가_자유!G46)","v":""},{"$f":"IF(평가_자유!H46=\"\",\"\",평가_자유!H46)","v":""},{"$f":"IF(평가_자유!I46=\"\",\"\",평가_자유!I46)","v":""},{"$f":"IF(평가_자유!J46=\"\",\"\",평가_자유!J46)","v":""},{"$f":"IF(평가_자유!K46=\"\",\"\",평가_자유!K46)","v":""}]
[{"$nulls":18},{"$f":"메인!D4&\"학업성적관리위원회\"","v":"충남중학교학업성적관리위원회"}]

{"sheet":"NEIS_교과","index":19,"n_rows":287,"n_cols":15,"rows_kept":287,"merged":[[1,2,1,8],[3,5,3,7],[4,2,5,2],[4,3,5,3],[4,4,5,4],[4,5,5,5],[4,6,5,8],[4,10,5,10],[6,2,12,2],[6,3,12,3],[6,6,12,8],[6,10,12,10],[13,2,19,2],[13,3,19,3],[13,6,19,8],[13,10,19,10],[20,2,26,2],[20,3,26,3],[20,6,26,8],[20,10,26,10],[27,2,33,2],[27,3,33,3],[27,6,33,8],[27,10,33,10],[34,2,40,2],[34,3,40,3],[34,6,40,8],[34,10,40,10],[41,2,47,2],[41,3,47,3],[41,6,47,8],[41,10,47,10],[48,2,54,2],[48,3,54,3],[48,6,54,8],[48,10,54,10],[55,2,61,2],[55,3,61,3],[55,6,61,8],[55,10,61,10],[62,2,68,2],[62,3,68,3],[62,6,68,8],[62,10,68,10],[69,2,75,2],[69,3,75,3],[69,6,75,8],[69,10,75,10],[76,2,82,2],[76,3,82,3],[76,6,82,8],[76,10,82,10],[83,2,89,2],[83,3,89,3],[83,6,89,8],[83,10,89,10],[90,2,96,2],[90,3,96,3],[90,6,96,8],[90,10,96,10],[97,2,103,2],[97,3,103,3],[97,6,103,8],[97,10,103,10],[104,2,110,2],[104,3,110,3],[104,6,110,8],[104,10,110,10],[111,2,117,2],[111,3,117,3],[111,6,117,8],[111,10,117,10],[118,2,124,2],[118,3,124,3],[118,6,124,8],[118,10,124,10],[125,2,131,2],[125,3,131,3],[125,6,131,8],[125,10,131,10],[132,2,138,2],[132,3,138,3],[132,6,138,8],[132,10,138,10],[139,2,145,2],[139,3,145,3],[139,6,145,8],[139,10,145,10],[146,2,152,2],[146,3,152,3],[146,6,152,8],[146,10,152,10],[153,2,159,2],[153,3,159,3],[153,6,159,8],[153,10,159,10],[160,2,166,2],[160,3,166,3],[160,6,166,8],[160,10,166,10],[167,2,173,2],[167,3,173,3],[167,6,173,8],[167,10,173,10],[174,2,180,2],[174,3,180,3],[174,6,180,8],[174,10,180,10],[181,2,187,2],[181,3,187,3],[181,6,187,8],[181,10,187,10],[188,2,194,2],[188,3,194,3],[188,6,194,8],[188,10,194,10],[195,2,201,2],[195,3,201,3],[195,6,201,8],[195,10,201,10],[202,2,208,2],[202,3,208,3],[202,6,208,8],[202,10,208,10],[209,2,215,2],[209,3,215,3],[209,6,215,8],[209,10,215,10],[216,2,222,2],[216,3,222,3],[216,6,222,8],[216,10,222,10],[223,2,229,2],[223,3,229,3],[223,6,229,8],[223,10,229,10],[230,2,236,2],[230,3,236,3],[230,6,236,8],[230,10,236,10],[237,2,243,2],[237,3,243,3],[237,6,243,8],[237,10,243,10],[244,2,250,2],[244,3,250,3],[244,6,250,8],[244,10,250,10],[251,2,257,2],[251,3,257,3],[251,6,257,8],[251,10,257,10],[258,2,264,2],[258,3,264,3],[258,6,264,8],[258,10,264,10],[265,2,271,2],[265,3,271,3],[265,6,271,8],[265,10,271,10],[272,2,278,2],[272,3,278,3],[272,6,278,8],[272,10,278,10],[279,2,285,2],[279,3,285,3],[279,6,285,8],[279,10,285,10]]}
[]
[null,null,{"$f":"\"자유학기 과정 중심 평가 결과 (교과 - \"&메인!H7&\")\"","v":"자유학기 과정 중심 평가 결과 (교과 - 기술·가정)"}]
[]
[null,null,{"$f":"메인!G4&메인!F4&\"  \"&메인!I4&메인!H4&\"  \"&메인!K4&메인!J4&\"  \"&메인!D6&메인!C6","v":"2018학년도  2학기  1학년  1반"},null,null,{"$f":"IF(메인!F7=\"\",\"\",IF(메인!D11=\"\",\"(메인 화면 시트에서 교과 프로그램 명칭을 반드시 입력해야 합니다.)\",\"[ \"&메인!D11&\" ]\"&\" / ( \"&메인!F7&\" 차시 )\"))","v":"[ 청소년의 생활, \n기술과 발명 ] / ( 34 차시 )"},null,null,{"$f":"\"지도교사 : \"&메인!G7&\"  (인)\"","v":"지도교사 : 김교과  (인)"}]
[null,null,"번\n호","성명","평가 요소","판정","NEIS 입력 서술 내용 : ( NEIS [성적]-[성적처리]-[과목별세부능력및특기사항] 에서 '세부능력 및 특기사항'으로 입력 )",{"$nulls":3},"글자 수"]
[{"$nulls":14},"원래 수식"]
[null,null,1,{"$f":"IF(VLOOKUP(C7,학적,2,FALSE)=\"\",\"\",VLOOKUP(C7,학적,2,FALSE))","v":"학생 1"},{"$f":"IF(VLOOKUP(C7,평가결과_공통,3,FALSE)=\"\",\"\",IF(메인!$J$7>=1,메인!$F$11,\"\"))","v":"형성평가 - 질문법"},{"$f":"IF(VLOOKUP(C7,평가결과_공통,3,FALSE)=\"\",\"\",VLOOKUP(C7,평가결과_공통,3,FALSE))","v":"C"},{"$f":"IF(OR(D7=\"\",COUNTBLANK(F7:F13)=7),\"\",VLOOKUP(D7,평가_교과!$D$7:$X$46,20,FALSE))","v":"질문의 핵심 내용에 대한 이해가 부족하여 답변의 내용이 부실하였으며, 단원에 대한 기본적인 학습활동이 다소 부족하나 일반적인 용어의 개념파악이 양호함. 수업활동에 적극적인 태도를 가지고 학습활동지를 수업과 연계하여 충실히 작성함으로써 교사의 질문에 대한 핵심 내용을 잘 파악하여 정확한 답변을 할 수 있는 학습 능력을 발휘함. 시각적으로 아이디어를 디자인하여 알기 쉽게 표현하는 알마인드맵 프로그램의 기본적인 기능을 활용 할 수 있음. 생활 속의 문제를 발견하고 해결하고자 하는 일반적인 노력을 마인드맵 프로그램으로 알맞게 표현함. 토픽과 서브토픽의 디자인 표현이 대체로 잘 되어있고 안정감 있게 배치되었음."},{"$nulls":3},{"$f":"IF(G7=\"\",\"\",LEN(G7))","v":340},{"$nulls":3},{"$f":"IF(OR(D7=\"\",메인!$D$11=\"\",COUNTBLANK(F7:F13)=7),\"\",IF(OR(F7=\"\",F7=\"전입\",F7=\"전출\"),\"\",VLOOKUP(F7,서술_공통1,2,FALSE))&\" \"&IF(OR(F8=\"\",F8=\"전입\",F8=\"전출\"),\"\",VLOOKUP(F8,서술_공통2,2,FALSE))&\" \"&IF(OR(F9=\"\",F9=\"전입\",F9=\"전출\"),\"\",VLOOKUP(F9,서술_공통3,2,FALSE))&\" \"&IF(OR(F10=\"\",F10=\"전입\",F10=\"전출\"),\"\",VLOOKUP(F10,서술_공통4,2,FALSE))&\" \"&IF(OR(F11=\"\",F11=\"전입\",F11=\"전출\"),\"\",VLOOKUP(F11,서술_공통5,2,FALSE))&\" \"&IF(OR(F12=\"\",F12=\"전입\",F12=\"전출\"),\"\",VLOOKUP(F12,서술_공통6,2,FALSE))&\" \"&IF(OR(F13=\"\",F13=\"전입\",F13=\"전출\"),\"\",VLOOKUP(F13,서술_공통7,2,FALSE)))","v":"질문의 핵심 내용에 대한 이해가 부족하여 답변의 내용이 부실하였으며, 단원에 대한 기본적인 학습활동이 다소 부족하나 일반적인 용어의 개념파악이 양호함. 수업활동에 적극적인 태도를 가지고 학습활동지를 수업과 연계하여 충실히 작성함으로써 교사의 질문에 대한 핵심 내용을 잘 파악하여 정확한 답변을 할 수 있는 학습 능력을 발휘함. 시각적으로 아이디어를 디자인하여 알기 쉽게 표현하는 알마인드맵 프로그램의 기본적인 기능을 활용 할 수 있음. 생활 속의 문제를 발견하고 해결하고자 하는 일반적인 노력을 마인드맵 프로그램으로 알맞게 표현함. 토픽과 서브토픽의 디자인 표현이 대체로 잘 되어있고 안정감 있게 배치되었음.   "}]
[{"$nulls":4},{"$f":"IF(VLOOKUP(C7,평가결과_공통,4,FALSE)=\"\",\"\",IF(메인!$J$7>=2,메인!$F$12,\"\"))","v":"형성평가 - 평가지"},{"$f":"IF(VLOOKUP(C7,평가결과_공통,4,FALSE)=\"\",\"\",VLOOKUP(C7,평가결과_공통,4,FALSE))","v":"B"}]
[{"$nulls":4},{"$f":"IF(VLOOKUP(C7,평가결과_공통,5,FALSE)=\"\",\"\",IF(메인!$J$7>=3,메인!$F$13,\"\"))","v":"포트폴리오 - 학습활동지"},{"$f":"IF(VLOOKUP(C7,평가결과_공통,5,FALSE)=\"\",\"\",VLOOKUP(C7,평가결과_공통,5,FALSE))","v":"A"}]
[{"$nulls":4},{"$f":"IF(VLOOKUP(C7,평가결과_공통,6,FALSE)=\"\",\"\",IF(메인!$J$7>=4,메인!$F$14,\"\"))","v":"마인드 맵 작성"},{"$f":"IF(VLOOKUP(C7,평가결과_공통,6,FALSE)=\"\",\"\",VLOOKUP(C7,평가결과_공통,6,FALSE))","v":"B"}]
[{"$nulls":4},{"$f":"IF(VLOOKUP(C7,평가결과_공통,7,FALSE)=\"\",\"\",IF(메인!$J$7>=5,메인!$F$15,\"\"))","v":""},{"$f":"IF(VLOOKUP(C7,평가결과_공통,7,FALSE)=\"\",\"\",VLOOKUP(C7,평가결과_공통,7,FALSE))","v":""}]
[{"$nulls":4},{"$f":"IF(VLOOKUP(C7,평가결과_공통,8,FALSE)=\"\",\"\",IF(메인!$J$7>=6,메인!$F$16,\"\"))","v":""},{"$f":"IF(VLOOKUP(C7,평가결과_공통,8,FALSE)=\"\",\"\",VLOOKUP(C7,평가결과_공통,8,FALSE))","v":""}]
[{"$nulls":4},{"$f":"IF(VLOOKUP(C7,평가결과_공통,9,FALSE)=\"\",\"\",IF(메인!$J$7>=7,메인!$F$17,\"\"))","v":""},{"$f":"IF(VLOOKUP(C7,평가결과_공통,9,FALSE)=\"\",\"\",VLOOKUP(C7,평가결과_공통,9,FALSE))","v":""}]
[null,null,2,{"$f":"IF(VLOOKUP(C14,학적,2,FALSE)=\"\",\"\",VLOOKUP(C14,학적,2,FALSE))","v":"학생 2"},{"$f":"IF(VLOOKUP(C14,평가결과_공통,3,FALSE)=\"\",\"\",IF(메인!$J$7>=1,메인!$F$11,\"\"))","v":"형성평가 - 질문법"},{"$f":"IF(VLOOKUP(C14,평가결과_공통,3,FALSE)=\"\",\"\",VLOOKUP(C14,평가결과_공통,3,FALSE))","v":"B"},{"$f":"IF(OR(D14=\"\",COUNTBLANK(F14:F20)=7),\"\",VLOOKUP(D14,평가_교과!$D$7:$X$46,20,FALSE))","v":"질문의 핵심 내용을 어느정도 알고 답변을 알맞게 잘 하였으며, 단원에 대한 기본적인 학습활동이 잘 되어있어 용어의 이해와 개념 파악이 우수함. 수업활동에 기본적인 태도를 가지고 학습활동지를 적절히 작성하였으며 교사의 질문에 대한 내용을 어느정도 파악하여 일부분 답변을 할 수 있는 학습 능력을 발휘함. 아이디어를 시각적으로 디자인하여 알기 쉽게 표현하는 알마인드맵 프로그램의 고급 기능에 익숙하여 사용을 매우 잘 함. 생활 속의 문제를 발견하고 해결하고자 하는 구체적인 노력을 마인드맵 프로그램으로 매우 잘 표현할 수 있음. 토픽과 서브토픽 내용의 상호 관련성이 매우 적절하며 디자인 요소의 표현이 잘 되어있고 안정감 있게 배치함으로써 전체 맵의 이해도를 높였음."},{"$nulls":3},{"$f":"IF(G14=\"\",\"\",LEN(G14))","v":371}]
[{"$nulls":4},{"$f":"IF(VLOOKUP(C14,평가결과_공통,4,FALSE)=\"\",\"\",IF(메인!$J$7>=2,메인!$F$12,\"\"))","v":"형성평가 - 평가지"},{"$f":"IF(VLOOKUP(C14,평가결과_공통,4,FALSE)=\"\",\"\",VLOOKUP(C14,평가결과_공통,4,FALSE))","v":"A"}]
[{"$nulls":4},{"$f":"IF(VLOOKUP(C14,평가결과_공통,5,FALSE)=\"\",\"\",IF(메인!$J$7>=3,메인!$F$13,\"\"))","v":"포트폴리오 - 학습활동지"},{"$f":"IF(VLOOKUP(C14,평가결과_공통,5,FALSE)=\"\",\"\",VLOOKUP(C14,평가결과_공통,5,FALSE))","v":"C"}]
[{"$nulls":4},{"$f":"IF(VLOOKUP(C14,평가결과_공통,6,FALSE)=\"\",\"\",IF(메인!$J$7>=4,메인!$F$14,\"\"))","v":"마인드 맵 작성"},{"$f":"IF(VLOOKUP(C14,평가결과_공통,6,FALSE)=\"\",\"\",VLOOKUP(C14,평가결과_공통,6,FALSE))","v":"A"}]
[{"$nulls":4},{"$f":"IF(VLOOKUP(C14,평가결과_공통,7,FALSE)=\"\",\"\",IF(메인!$J$7>=5,메인!$F$15,\"\"))","v":""},{"$f":"IF(VLOOKUP(C14,평가결과_공통,7,FALSE)=\"\",\"\",VLOOKUP(C14,평가결과_공통,7,FALSE))","v":""}]
[{"$nulls":4},{"$f":"IF(VLOOKUP(C14,평가결과_공통,8,FALSE)=\"\",\"\",IF(메인!$J$7>=6,메인!$F$16,\"\"))","v":""},{"$f":"IF(VLOOKUP(C14,평가결과_공통,8,FALSE)=\"\",\"\",VLOOKUP(C14,평가결과_공통,8,FALSE))","v":""}]
[{"$nulls":4},{"$f":"IF(VLOOKUP(C14,평가결과_공통,9,FALSE)=\"\",\"\",IF(메인!$J$7>=7,메인!$F$17,\"\"))","v":""},{"$f":"IF(VLOOKUP(C14,평가결과_공통,9,FALSE)=\"\",\"\",VLOOKUP(C14,평가결과_공통,9,FALSE))","v":""}]
[null,null,3,{"$f":"IF(VLOOKUP(C21,학적,2,FALSE)=\"\",\"\",VLOOKUP(C21,학적,2,FALSE))","v":"학생 3"},{"$f":"IF(VLOOKUP(C21,평가결과_공통,3,FALSE)=\"\",\"\",IF(메인!$J$7>=1,메인!$F$11,\"\"))","v":"형성평가 - 질문법"},{"$f":"IF(VLOOKUP(C21,평가결과_공통,3,FALSE)=\"\",\"\",VLOOKUP(C21,평가결과_공통,3,FALSE))","v":"C"},{"$f":"IF(OR(D21=\"\",COUNTBLANK(F21:F27)=7),\"\",VLOOKUP(D21,평가_교과!$D$7:$X$46,20,FALSE))","v":"질문의 핵심 내용에 대한 이해가 부족하여 답변의 내용이 부실하였으며, 단원에 대한 기본적인 학습활동이 다소 부족하나 일반적인 용어의 개념파악이 양호함. 수업활동에 적극적인 태도를 가지고 학습활동지를 수업과 연계하여 충실히 작성함으로써 교사의 질문에 대한 핵심 내용을 잘 파악하여 정확한 답변을 할 수 있는 학습 능력을 발휘함. 시각적으로 아이디어를 디자인하여 알기 쉽게 표현하는 알마인드맵 프로그램의 기본적인 기능을 활용 할 수 있음. 생활 속의 문제를 발견하고 해결하고자 하는 일반적인 노력을 마인드맵 프로그램으로 알맞게 표현함. 토픽과 서브토픽의 디자인 표현이 대체로 잘 되어있고 안정감 있게 배치되었음."},{"$nulls":3},{"$f":"IF(G21=\"\",\"\",LEN(G21))","v":340}]
[{"$nulls":4},{"$f":"IF(VLOOKUP(C21,평가결과_공통,4,FALSE)=\"\",\"\",IF(메인!$J$7>=2,메인!$F$12,\"\"))","v":"형성평가 - 평가지"},{"$f":"IF(VLOOKUP(C21,평가결과_공통,4,FALSE)=\"\",\"\",VLOOKUP(C21,평가결과_공통,4,FALSE))","v":"B"}]
[{"$nulls":4},{"$f":"IF(VLOOKUP(C21,평가결과_공통,5,FALSE)=\"\",\"\",IF(메인!$J$7>=3,메인!$F$13,\"\"))","v":"포트폴리오 - 학습활동지"},{"$f":"IF(VLOOKUP(C21,평가결과_공통,5,FALSE)=\"\",\"\",VLOOKUP(C21,평가결과_공통,5,FALSE))","v":"A"}]
[{"$nulls":4},{"$f":"IF(VLOOKUP(C21,평가결과_공통,6,FALSE)=\"\",\"\",IF(메인!$J$7>=4,메인!$F$14,\"\"))","v":"마인드 맵 작성"},{"$f":"IF(VLOOKUP(C21,평가결과_공통,6,FALSE)=\"\",\"\",VLOOKUP(C21,평가결과_공통,6,FALSE))","v":"B"}]
[{"$nulls":4},{"$f":"IF(VLOOKUP(C21,평가결과_공통,7,FALSE)=\"\",\"\",IF(메인!$J$7>=5,메인!$F$15,\"\"))","v":""},{"$f":"IF(VLOOKUP(C21,평가결과_공통,7,FALSE)=\"\",\"\",VLOOKUP(C21,평가결과_공통,7,FALSE))","v":""}]
[{"$nulls":4},{"$f":"IF(VLOOKUP(C21,평가결과_공통,8,FALSE)=\"\",\"\",IF(메인!$J$7>=6,메인!$F$16,\"\"))","v":""},{"$f":"IF(VLOOKUP(C21,평가결과_공통,8,FALSE)=\"\",\"\",VLOOKUP(C21,평가결과_공통,8,FALSE))","v":""}]
[{"$nulls":4},{"$f":"IF(VLOOKUP(C21,평가결과_공통,9,FALSE)=\"\",\"\",IF(메인!$J$7>=7,메인!$F$17,\"\"))","v":""},{"$f":"IF(VLOOKUP(C21,평가결과_공통,9,FALSE)=\"\",\"\",VLOOKUP(C21,평가결과_공통,9,FALSE))","v":""}]
[null,null,4,{"$f":"IF(VLOOKUP(C28,학적,2,FALSE)=\"\",\"\",VLOOKUP(C28,학적,2,FALSE))","v":"학생 4"},{"$f":"IF(VLOOKUP(C28,평가결과_공통,3,FALSE)=\"\",\"\",IF(메인!$J$7>=1,메인!$F$11,\"\"))","v":"형성평가 - 질문법"},{"$f":"IF(VLOOKUP(C28,평가결과_공통,3,FALSE)=\"\",\"\",VLOOKUP(C28,평가결과_공통,3,FALSE))","v":"A"},{"$f":"IF(OR(D28=\"\",COUNTBLANK(F28:F34)=7),\"\",VLOOKUP(D28,평가_교과!$D$7:$X$46,20,FALSE))","v":"질문의 핵심 내용을 분명하게 알고 자신있는 답변을 정확하게 하였으며, 단원에 대한 기본적인 학습활동이 잘 되어있어 용어의 이해와 개념 파악이 우수함. 수업활동에 관심을 가지고 학습활동지를 수업과 연계하여 적절히 작성하였으며 교사의 질문에 대한 핵심 내용을 잘 파악하여 적절한 답변을 할 수 있는 학습 능력을 발휘함. 구상된 아이디어를 알기 쉽게 표현하는 알마인드맵 프로그램의 기본적인 사용을 할 수 있음. 생활 속의 문제를 발견하고 해결하고자 하는 기본적인 노력을 마인드맵 프로그램으로 적절히 표현함. 맵의 디자인 표현이 잘 되어있고 토픽이 안정감 있게 배치됨."},{"$nulls":3},{"$f":"IF(G28=\"\",\"\",LEN(G28))","v":314}]
[{"$nulls":4},{"$f":"IF(VLOOKUP(C28,평가결과_공통,4,FALSE)=\"\",\"\",IF(메인!$J$7>=2,메인!$F$12,\"\"))","v":"형성평가 - 평가지"},{"$f":"IF(VLOOKUP(C28,평가결과_공통,4,FALSE)=\"\",\"\",VLOOKUP(C28,평가결과_공통,4,FALSE))","v":"A"}]
[{"$nulls":4},{"$f":"IF(VLOOKUP(C28,평가결과_공통,5,FALSE)=\"\",\"\",IF(메인!$J$7>=3,메인!$F$13,\"\"))","v":"포트폴리오 - 학습활동지"},{"$f":"IF(VLOOKUP(C28,평가결과_공통,5,FALSE)=\"\",\"\",VLOOKUP(C28,평가결과_공통,5,FALSE))","v":"B"}]
[{"$nulls":4},{"$f":"IF(VLOOKUP(C28,평가결과_공통,6,FALSE)=\"\",\"\",IF(메인!$J$7>=4,메인!$F$14,\"\"))","v":"마인드 맵 작성"},{"$f":"IF(VLOOKUP(C28,평가결과_공통,6,FALSE)=\"\",\"\",VLOOKUP(C28,평가결과_공통,6,FALSE))","v":"C"}]
[{"$nulls":4},{"$f":"IF(VLOOKUP(C28,평가결과_공통,7,FALSE)=\"\",\"\",IF(메인!$J$7>=5,메인!$F$15,\"\"))","v":""},{"$f":"IF(VLOOKUP(C28,평가결과_공통,7,FALSE)=\"\",\"\",VLOOKUP(C28,평가결과_공통,7,FALSE))","v":""}]
[{"$nulls":4},{"$f":"IF(VLOOKUP(C28,평가결과_공통,8,FALSE)=\"\",\"\",IF(메인!$J$7>=6,메인!$F$16,\"\"))","v":""},{"$f":"IF(VLOOKUP(C28,평가결과_공통,8,FALSE)=\"\",\"\",VLOOKUP(C28,평가결과_공통,8,FALSE))","v":""}]
[{"$nulls":4},{"$f":"IF(VLOOKUP(C28,평가결과_공통,9,FALSE)=\"\",\"\",IF(메인!$J$7>=7,메인!$F$17,\"\"))","v":""},{"$f":"IF(VLOOKUP(C28,평가결과_공통,9,FALSE)=\"\",\"\",VLOOKUP(C28,평가결과_공통,9,FALSE))","v":""}]
[null,null,5,{"$f":"IF(VLOOKUP(C35,학적,2,FALSE)=\"\",\"\",VLOOKUP(C35,학적,2,FALSE))","v":"학생 5"},{"$f":"IF(VLOOKUP(C35,평가결과_공통,3,FALSE)=\"\",\"\",IF(메인!$J$7>=1,메인!$F$11,\"\"))","v":"형성평가 - 질문법"},{"$f":"IF(VLOOKUP(C35,평가결과_공통,3,FALSE)=\"\",\"\",VLOOKUP(C35,평가결과_공통,3,FALSE))","v":"B"},{"$f":"IF(OR(D35=\"\",COUNTBLANK(F35:F41)=7),\"\",VLOOKUP(D35,평가_교과!$D$7:$X$46,20,FALSE))","v":"질문의 핵심 내용을 어느정도 알고 답변을 알맞게 잘 하였으며, 단원에 대한 기본적인 학습활동이 잘 되어있어 용어의 이해와 개념 파악이 우수함. 수업활동에 적극적인 태도를 가지고 학습활동지를 수업과 연계하여 충실히 작성함으로써 교사의 질문에 대한 핵심 내용을 잘 파악하여 정확한 답변을 할 수 있는 학습 능력을 발휘함. 아이디어를 시각적으로 디자인하여 알기 쉽게 표현하는 알마인드맵 프로그램의 고급 기능에 익숙하여 사용을 매우 잘 함. 생활 속의 문제를 발견하고 해결하고자 하는 구체적인 노력을 마인드맵 프로그램으로 매우 잘 표현할 수 있음. 토픽과 서브토픽 내용의 상호 관련성이 매우 적절하며 디자인 요소의 표현이 잘 되어있고 안정감 있게 배치함으로써 전체 맵의 이해도를 높였음."},{"$nulls":3},{"$f":"IF(G35=\"\",\"\",LEN(G35))","v":380}]
[{"$nulls":4},{"$f":"IF(VLOOKUP(C35,평가결과_공통,4,FALSE)=\"\",\"\",IF(메인!$J$7>=2,메인!$F$12,\"\"))","v":"형성평가 - 평가지"},{"$f":"IF(VLOOKUP(C35,평가결과_공통,4,FALSE)=\"\",\"\",VLOOKUP(C35,평가결과_공통,4,FALSE))","v":"A"}]
[{"$nulls":4},{"$f":"IF(VLOOKUP(C35,평가결과_공통,5,FALSE)=\"\",\"\",IF(메인!$J$7>=3,메인!$F$13,\"\"))","v":"포트폴리오 - 학습활동지"},{"$f":"IF(VLOOKUP(C35,평가결과_공통,5,FALSE)=\"\",\"\",VLOOKUP(C35,평가결과_공통,5,FALSE))","v":"A"}]
[{"$nulls":4},{"$f":"IF(VLOOKUP(C35,평가결과_공통,6,FALSE)=\"\",\"\",IF(메인!$J$7>=4,메인!$F$14,\"\"))","v":"마인드 맵 작성"},{"$f":"IF(VLOOKUP(C35,평가결과_공통,6,FALSE)=\"\",\"\",VLOOKUP(C35,평가결과_공통,6,FALSE))","v":"A"}]
[{"$nulls":4},{"$f":"IF(VLOOKUP(C35,평가결과_공통,7,FALSE)=\"\",\"\",IF(메인!$J$7>=5,메인!$F$15,\"\"))","v":""},{"$f":"IF(VLOOKUP(C35,평가결과_공통,7,FALSE)=\"\",\"\",VLOOKUP(C35,평가결과_공통,7,FALSE))","v":""}]
[{"$nulls":4},{"$f":"IF(VLOOKUP(C35,평가결과_공통,8,FALSE)=\"\",\"\",IF(메인!$J$7>=6,메인!$F$16,\"\"))","v":""},{"$f":"IF(VLOOKUP(C35,평가결과_공통,8,FALSE)=\"\",\"\",VLOOKUP(C35,평가결과_공통,8,FALSE))","v":""}]
[{"$nulls":4},{"$f":"IF(VLOOKUP(C35,평가결과_공통,9,FALSE)=\"\",\"\",IF(메인!$J$7>=7,메인!$F$17,\"\"))","v":""},{"$f":"IF(VLOOKUP(C35,평가결과_공통,9,FALSE)=\"\",\"\",VLOOKUP(C35,평가결과_공통,9,FALSE))","v":""}]
[null,null,6,{"$f":"IF(VLOOKUP(C42,학적,2,FALSE)=\"\",\"\",VLOOKUP(C42,학적,2,FALSE))","v":"학생 6"},{"$f":"IF(VLOOKUP(C42,평가결과_공통,3,FALSE)=\"\",\"\",IF(메인!$J$7>=1,메인!$F$11,\"\"))","v":"형성평가 - 질문법"},{"$f":"IF(VLOOKUP(C42,평가결과_공통,3,FALSE)=\"\",\"\",VLOOKUP(C42,평가결과_공통,3,FALSE))","v":"C"},{"$f":"IF(OR(D42=\"\",COUNTBLANK(F42:F48)=7),\"\",VLOOKUP(D42,평가_교과!$D$7:$X$46,20,FALSE))","v":"질문의 핵심 내용에 대한 이해가 부족하여 답변의 내용이 부실하였으며, 단원에 대한 기본적인 학습활동이 잘 되어있어 용어의 이해와 개념 파악이 우수함. 수업활동에 관심을 가지고 학습활동지를 수업과 연계하여 적절히 작성하였으며 교사의 질문에 대한 핵심 내용을 잘 파악하여 적절한 답변을 할 수 있는 학습 능력을 발휘함. 시각적으로 아이디어를 디자인하여 알기 쉽게 표현하는 알마인드맵 프로그램의 기본적인 기능을 활용 할 수 있음. 생활 속의 문제를 발견하고 해결하고자 하는 일반적인 노력을 마인드맵 프로그램으로 알맞게 표현함. 토픽과 서브토픽의 디자인 표현이 대체로 잘 되어있고 안정감 있게 배치되었음."},{"$nulls":3},{"$f":"IF(G42=\"\",\"\",LEN(G42))","v":334}]
[{"$nulls":4},{"$f":"IF(VLOOKUP(C42,평가결과_공통,4,FALSE)=\"\",\"\",IF(메인!$J$7>=2,메인!$F$12,\"\"))","v":"형성평가 - 평가지"},{"$f":"IF(VLOOKUP(C42,평가결과_공통,4,FALSE)=\"\",\"\",VLOOKUP(C42,평가결과_공통,4,FALSE))","v":"A"}]
[{"$nulls":4},{"$f":"IF(VLOOKUP(C42,평가결과_공통,5,FALSE)=\"\",\"\",IF(메인!$J$7>=3,메인!$F$13,\"\"))","v":"포트폴리오 - 학습활동지"},{"$f":"IF(VLOOKUP(C42,평가결과_공통,5,FALSE)=\"\",\"\",VLOOKUP(C42,평가결과_공통,5,FALSE))","v":"B"}]
[{"$nulls":4},{"$f":"IF(VLOOKUP(C42,평가결과_공통,6,FALSE)=\"\",\"\",IF(메인!$J$7>=4,메인!$F$14,\"\"))","v":"마인드 맵 작성"},{"$f":"IF(VLOOKUP(C42,평가결과_공통,6,FALSE)=\"\",\"\",VLOOKUP(C42,평가결과_공통,6,FALSE))","v":"B"}]
[{"$nulls":4},{"$f":"IF(VLOOKUP(C42,평가결과_공통,7,FALSE)=\"\",\"\",IF(메인!$J$7>=5,메인!$F$15,\"\"))","v":""},{"$f":"IF(VLOOKUP(C42,평가결과_공통,7,FALSE)=\"\",\"\",VLOOKUP(C42,평가결과_공통,7,FALSE))","v":""}]
[{"$nulls":4},{"$f":"IF(VLOOKUP(C42,평가결과_공통,8,FALSE)=\"\",\"\",IF(메인!$J$7>=6,메인!$F$16,\"\"))","v":""},{"$f":"IF(VLOOKUP(C42,평가결과_공통,8,FALSE)=\"\",\"\",VLOOKUP(C42,평가결과_공통,8,FALSE))","v":""}]
[{"$nulls":4},{"$f":"IF(VLOOKUP(C42,평가결과_공통,9,FALSE)=\"\",\"\",IF(메인!$J$7>=7,메인!$F$17,\"\"))","v":""},{"$f":"IF(VLOOKUP(C42,평가결과_공통,9,FALSE)=\"\",\"\",VLOOKUP(C42,평가결과_공통,9,FALSE))","v":""}]
[null,null,7,{"$f":"IF(VLOOKUP(C49,학적,2,FALSE)=\"\",\"\",VLOOKUP(C49,학적,2,FALSE))","v":"학생 7"},{"$f":"IF(VLOOKUP(C49,평가결과_공통,3,FALSE)=\"\",\"\",IF(메인!$J$7>=1,메인!$F$11,\"\"))","v":"형성평가 - 질문법"},{"$f":"IF(VLOOKUP(C49,평가결과_공통,3,FALSE)=\"\",\"\",VLOOKUP(C49,평가결과_공통,3,FALSE))","v":"A"},{"$f":"IF(OR(D49=\"\",COUNTBLANK(F49:F55)=7),\"\",VLOOKUP(D49,평가_교과!$D$7:$X$46,20,FALSE))","v":"질문의 핵심 내용을 분명하게 알고 자신있는 답변을 정확하게 하였으며, 단원에 대한 기본적인 학습활동이 다소 부족하나 일반적인 용어의 개념파악이 양호함. 수업활동에 관심을 가지고 학습활동지를 수업과 연계하여 적절히 작성하였으며 교사의 질문에 대한 핵심 내용을 잘 파악하여 적절한 답변을 할 수 있는 학습 능력을 발휘함. 구상된 아이디어를 알기 쉽게 표현하는 알마인드맵 프로그램의 기본적인 사용을 할 수 있음. 생활 속의 문제를 발견하고 해결하고자 하는 기본적인 노력을 마인드맵 프로그램으로 적절히 표현함. 맵의 디자인 표현이 잘 되어있고 토픽이 안정감 있게 배치됨."},{"$nulls":3},{"$f":"IF(G49=\"\",\"\",LEN(G49))","v":315}]
[{"$nulls":4},{"$f":"IF(VLOOKUP(C49,평가결과_공통,4,FALSE)=\"\",\"\",IF(메인!$J$7>=2,메인!$F$12,\"\"))","v":"형성평가 - 평가지"},{"$f":"IF(VLOOKUP(C49,평가결과_공통,4,FALSE)=\"\",\"\",VLOOKUP(C49,평가결과_공통,4,FALSE))","v":"B"}]
[{"$nulls":4},{"$f":"IF(VLOOKUP(C49,평가결과_공통,5,FALSE)=\"\",\"\",IF(메인!$J$7>=3,메인!$F$13,\"\"))","v":"포트폴리오 - 학습활동지"},{"$f":"IF(VLOOKUP(C49,평가결과_공통,5,FALSE)=\"\",\"\",VLOOKUP(C49,평가결과_공통,5,FALSE))","v":"B"}]
[{"$nulls":4},{"$f":"IF(VLOOKUP(C49,평가결과_공통,6,FALSE)=\"\",\"\",IF(메인!$J$7>=4,메인!$F$14,\"\"))","v":"마인드 맵 작성"},{"$f":"IF(VLOOKUP(C49,평가결과_공통,6,FALSE)=\"\",\"\",VLOOKUP(C49,평가결과_공통,6,FALSE))","v":"C"}]
[{"$nulls":4},{"$f":"IF(VLOOKUP(C49,평가결과_공통,7,FALSE)=\"\",\"\",IF(메인!$J$7>=5,메인!$F$15,\"\"))","v":""},{"$f":"IF(VLOOKUP(C49,평가결과_공통,7,FALSE)=\"\",\"\",VLOOKUP(C49,평가결과_공통,7,FALSE))","v":""}]
[{"$nulls":4},{"$f":"IF(VLOOKUP(C49,평가결과_공통,8,FALSE)=\"\",\"\",IF(메인!$J$7>=6,메인!$F$16,\"\"))","v":""},{"$f":"IF(VLOOKUP(C49,평가결과_공통,8,FALSE)=\"\",\"\",VLOOKUP(C49,평가결과_공통,8,FALSE))","v":""}]
[{"$nulls":4},{"$f":"IF(VLOOKUP(C49,평가결과_공통,9,FALSE)=\"\",\"\",IF(메인!$J$7>=7,메인!$F$17,\"\"))","v":""},{"$f":"IF(VLOOKUP(C49,평가결과_공통,9,FALSE)=\"\",\"\",VLOOKUP(C49,평가결과_공통,9,FALSE))","v":""}]
[null,null,8,{"$f":"IF(VLOOKUP(C56,학적,2,FALSE)=\"\",\"\",VLOOKUP(C56,학적,2,FALSE))","v":"학생 8"},{"$f":"IF(VLOOKUP(C56,평가결과_공통,3,FALSE)=\"\",\"\",IF(메인!$J$7>=1,메인!$F$11,\"\"))","v":"형성평가 - 질문법"},{"$f":"IF(VLOOKUP(C56,평가결과_공통,3,FALSE)=\"\",\"\",VLOOKUP(C56,평가결과_공통,3,FALSE))","v":"B"},{"$f":"IF(OR(D56=\"\",COUNTBLANK(F56:F62)=7),\"\",VLOOKUP(D56,평가_교과!$D$7:$X$46,20,FALSE))","v":"질문의 핵심 내용을 어느정도 알고 답변을 알맞게 잘 하였으며, 단원에 대한 기본적인 학습활동이 잘 되어있어 용어의 이해와 개념 파악이 우수함. 수업활동에 기본적인 태도를 가지고 학습활동지를 적절히 작성하였으며 교사의 질문에 대한 내용을 어느정도 파악하여 일부분 답변을 할 수 있는 학습 능력을 발휘함. 아이디어를 시각적으로 디자인하여 알기 쉽게 표현하는 알마인드맵 프로그램의 고급 기능에 익숙하여 사용을 매우 잘 함. 생활 속의 문제를 발견하고 해결하고자 하는 구체적인 노력을 마인드맵 프로그램으로 매우 잘 표현할 수 있음. 토픽과 서브토픽 내용의 상호 관련성이 매우 적절하며 디자인 요소의 표현이 잘 되어있고 안정감 있게 배치함으로써 전체 맵의 이해도를 높였음."},{"$nulls":3},{"$f":"IF(G56=\"\",\"\",LEN(G56))","v":371}]
[{"$nulls":4},{"$f":"IF(VLOOKUP(C56,평가결과_공통,4,FALSE)=\"\",\"\",IF(메인!$J$7>=2,메인!$F$12,\"\"))","v":"형성평가 - 평가지"},{"$f":"IF(VLOOKUP(C56,평가결과_공통,4,FALSE)=\"\",\"\",VLOOKUP(C56,평가결과_공통,4,FALSE))","v":"A"}]
[{"$nulls":4},{"$f":"IF(VLOOKUP(C56,평가결과_공통,5,FALSE)=\"\",\"\",IF(메인!$J$7>=3,메인!$F$13,\"\"))","v":"포트폴리오 - 학습활동지"},{"$f":"IF(VLOOKUP(C56,평가결과_공통,5,FALSE)=\"\",\"\",VLOOKUP(C56,평가결과_공통,5,FALSE))","v":"C"}]
[{"$nulls":4},{"$f":"IF(VLOOKUP(C56,평가결과_공통,6,FALSE)=\"\",\"\",IF(메인!$J$7>=4,메인!$F$14,\"\"))","v":"마인드 맵 작성"},{"$f":"IF(VLOOKUP(C56,평가결과_공통,6,FALSE)=\"\",\"\",VLOOKUP(C56,평가결과_공통,6,FALSE))","v":"A"}]
[{"$nulls":4},{"$f":"IF(VLOOKUP(C56,평가결과_공통,7,FALSE)=\"\",\"\",IF(메인!$J$7>=5,메인!$F$15,\"\"))","v":""},{"$f":"IF(VLOOKUP(C56,평가결과_공통,7,FALSE)=\"\",\"\",VLOOKUP(C56,평가결과_공통,7,FALSE))","v":""}]
[{"$nulls":4},{"$f":"IF(VLOOKUP(C56,평가결과_공통,8,FALSE)=\"\",\"\",IF(메인!$J$7>=6,메인!$F$16,\"\"))","v":""},{"$f":"IF(VLOOKUP(C56,평가결과_공통,8,FALSE)=\"\",\"\",VLOOKUP(C56,평가결과_공통,8,FALSE))","v":""}]
[{"$nulls":4},{"$f":"IF(VLOOKUP(C56,평가결과_공통,9,FALSE)=\"\",\"\",IF(메인!$J$7>=7,메인!$F$17,\"\"))","v":""},{"$f":"IF(VLOOKUP(C56,평가결과_공통,9,FALSE)=\"\",\"\",VLOOKUP(C56,평가결과_공통,9,FALSE))","v":""}]
[null,null,9,{"$f":"IF(VLOOKUP(C63,학적,2,FALSE)=\"\",\"\",VLOOKUP(C63,학적,2,FALSE))","v":"학생 9"},{"$f":"IF(VLOOKUP(C63,평가결과_공통,3,FALSE)=\"\",\"\",IF(메인!$J$7>=1,메인!$F$11,\"\"))","v":"형성평가 - 질문법"},{"$f":"IF(VLOOKUP(C63,평가결과_공통,3,FALSE)=\"\",\"\",VLOOKUP(C63,평가결과_공통,3,FALSE))","v":"A"},{"$f":"IF(OR(D63=\"\",COUNTBLANK(F63:F69)=7),\"\",VLOOKUP(D63,평가_교과!$D$7:$X$46,20,FALSE))","v":"질문의 핵심 내용을 분명하게 알고 자신있는 답변을 정확하게 하였으며, 단원에 대한 기본적인 학습활동이 다소 부족하나 일반적인 용어의 개념파악이 양호함. 수업활동에 적극적인 태도를 가지고 학습활동지를 수업과 연계하여 충실히 작성함으로써 교사의 질문에 대한 핵심 내용을 잘 파악하여 정확한 답변을 할 수 있는 학습 능력을 발휘함. 구상된 아이디어를 알기 쉽게 표현하는 알마인드맵 프로그램의 기본적인 사용을 할 수 있음. 생활 속의 문제를 발견하고 해결하고자 하는 기본적인 노력을 마인드맵 프로그램으로 적절히 표현함. 맵의 디자인 표현이 잘 되어있고 토픽이 안정감 있게 배치됨."},{"$nulls":3},{"$f":"IF(G63=\"\",\"\",LEN(G63))","v":320}]
[{"$nulls":4},{"$f":"IF(VLOOKUP(C63,평가결과_공통,4,FALSE)=\"\",\"\",IF(메인!$J$7>=2,메인!$F$12,\"\"))","v":"형성평가 - 평가지"},{"$f":"IF(VLOOKUP(C63,평가결과_공통,4,FALSE)=\"\",\"\",VLOOKUP(C63,평가결과_공통,4,FALSE))","v":"B"}]
[{"$nulls":4},{"$f":"IF(VLOOKUP(C63,평가결과_공통,5,FALSE)=\"\",\"\",IF(메인!$J$7>=3,메인!$F$13,\"\"))","v":"포트폴리오 - 학습활동지"},{"$f":"IF(VLOOKUP(C63,평가결과_공통,5,FALSE)=\"\",\"\",VLOOKUP(C63,평가결과_공통,5,FALSE))","v":"A"}]
[{"$nulls":4},{"$f":"IF(VLOOKUP(C63,평가결과_공통,6,FALSE)=\"\",\"\",IF(메인!$J$7>=4,메인!$F$14,\"\"))","v":"마인드 맵 작성"},{"$f":"IF(VLOOKUP(C63,평가결과_공통,6,FALSE)=\"\",\"\",VLOOKUP(C63,평가결과_공통,6,FALSE))","v":"C"}]
[{"$nulls":4},{"$f":"IF(VLOOKUP(C63,평가결과_공통,7,FALSE)=\"\",\"\",IF(메인!$J$7>=5,메인!$F$15,\"\"))","v":""},{"$f":"IF(VLOOKUP(C63,평가결과_공통,7,FALSE)=\"\",\"\",VLOOKUP(C63,평가결과_공통,7,FALSE))","v":""}]
[{"$nulls":4},{"$f":"IF(VLOOKUP(C63,평가결과_공통,8,FALSE)=\"\",\"\",IF(메인!$J$7>=6,메인!$F$16,\"\"))","v":""},{"$f":"IF(VLOOKUP(C63,평가결과_공통,8,FALSE)=\"\",\"\",VLOOKUP(C63,평가결과_공통,8,FALSE))","v":""}]
[{"$nulls":4},{"$f":"IF(VLOOKUP(C63,평가결과_공통,9,FALSE)=\"\",\"\",IF(메인!$J$7>=7,메인!$F$17,\"\"))","v":""},{"$f":"IF(VLOOKUP(C63,평가결과_공통,9,FALSE)=\"\",\"\",VLOOKUP(C63,평가결과_공통,9,FALSE))","v":""}]
[null,null,10,{"$f":"IF(VLOOKUP(C70,학적,2,FALSE)=\"\",\"\",VLOOKUP(C70,학적,2,FALSE))","v":"학생10"},{"$f":"IF(VLOOKUP(C70,평가결과_공통,3,FALSE)=\"\",\"\",IF(메인!$J$7>=1,메인!$F$11,\"\"))","v":"형성평가 - 질문법"},{"$f":"IF(VLOOKUP(C70,평가결과_공통,3,FALSE)=\"\",\"\",VLOOKUP(C70,평가결과_공통,3,FALSE))","v":"C"},{"$f":"IF(OR(D70=\"\",COUNTBLANK(F70:F76)=7),\"\",VLOOKUP(D70,평가_교과!$D$7:$X$46,20,FALSE))","v":"질문의 핵심 내용에 대한 이해가 부족하여 답변의 내용이 부실하였으며, 단원에 대한 기본적인 학습활동이 다소 부족하나 일반적인 용어의 개념파악이 양호함. 수업활동에 적극적인 태도를 가지고 학습활동지를 수업과 연계하여 충실히 작성함으로써 교사의 질문에 대한 핵심 내용을 잘 파악하여 정확한 답변을 할 수 있는 학습 능력을 발휘함. 시각적으로 아이디어를 디자인하여 알기 쉽게 표현하는 알마인드맵 프로그램의 기본적인 기능을 활용 할 수 있음. 생활 속의 문제를 발견하고 해결하고자 하는 일반적인 노력을 마인드맵 프로그램으로 알맞게 표현함. 토픽과 서브토픽의 디자인 표현이 대체로 잘 되어있고 안정감 있게 배치되었음."},{"$nulls":3},{"$f":"IF(G70=\"\",\"\",LEN(G70))","v":340}]
[{"$nulls":4},{"$f":"IF(VLOOKUP(C70,평가결과_공통,4,FALSE)=\"\",\"\",IF(메인!$J$7>=2,메인!$F$12,\"\"))","v":"형성평가 - 평가지"},{"$f":"IF(VLOOKUP(C70,평가결과_공통,4,FALSE)=\"\",\"\",VLOOKUP(C70,평가결과_공통,4,FALSE))","v":"B"}]
[{"$nulls":4},{"$f":"IF(VLOOKUP(C70,평가결과_공통,5,FALSE)=\"\",\"\",IF(메인!$J$7>=3,메인!$F$13,\"\"))","v":"포트폴리오 - 학습활동지"},{"$f":"IF(VLOOKUP(C70,평가결과_공통,5,FALSE)=\"\",\"\",VLOOKUP(C70,평가결과_공통,5,FALSE))","v":"A"}]
[{"$nulls":4},{"$f":"IF(VLOOKUP(C70,평가결과_공통,6,FALSE)=\"\",\"\",IF(메인!$J$7>=4,메인!$F$14,\"\"))","v":"마인드 맵 작성"},{"$f":"IF(VLOOKUP(C70,평가결과_공통,6,FALSE)=\"\",\"\",VLOOKUP(C70,평가결과_공통,6,FALSE))","v":"B"}]
[{"$nulls":4},{"$f":"IF(VLOOKUP(C70,평가결과_공통,7,FALSE)=\"\",\"\",IF(메인!$J$7>=5,메인!$F$15,\"\"))","v":""},{"$f":"IF(VLOOKUP(C70,평가결과_공통,7,FALSE)=\"\",\"\",VLOOKUP(C70,평가결과_공통,7,FALSE))","v":""}]
[{"$nulls":4},{"$f":"IF(VLOOKUP(C70,평가결과_공통,8,FALSE)=\"\",\"\",IF(메인!$J$7>=6,메인!$F$16,\"\"))","v":""},{"$f":"IF(VLOOKUP(C70,평가결과_공통,8,FALSE)=\"\",\"\",VLOOKUP(C70,평가결과_공통,8,FALSE))","v":""}]
[{"$nulls":4},{"$f":"IF(VLOOKUP(C70,평가결과_공통,9,FALSE)=\"\",\"\",IF(메인!$J$7>=7,메인!$F$17,\"\"))","v":""},{"$f":"IF(VLOOKUP(C70,평가결과_공통,9,FALSE)=\"\",\"\",VLOOKUP(C70,평가결과_공통,9,FALSE))","v":""}]
[null,null,11,{"$f":"IF(VLOOKUP(C77,학적,2,FALSE)=\"\",\"\",VLOOKUP(C77,학적,2,FALSE))","v":"학생11"},{"$f":"IF(VLOOKUP(C77,평가결과_공통,3,FALSE)=\"\",\"\",IF(메인!$J$7>=1,메인!$F$11,\"\"))","v":"형성평가 - 질문법"},{"$f":"IF(VLOOKUP(C77,평가결과_공통,3,FALSE)=\"\",\"\",VLOOKUP(C77,평가결과_공통,3,FALSE))","v":"B"},{"$f":"IF(OR(D77=\"\",COUNTBLANK(F77:F83)=7),\"\",VLOOKUP(D77,평가_교과!$D$7:$X$46,20,FALSE))","v":"질문의 핵심 내용을 어느정도 알고 답변을 알맞게 잘 하였으며, 단원에 대한 기본적인 학습활동이 잘 되어있어 용어의 이해와 개념 파악이 우수함. 수업활동에 관심을 가지고 학습활동지를 수업과 연계하여 적절히 작성하였으며 교사의 질문에 대한 핵심 내용을 잘 파악하여 적절한 답변을 할 수 있는 학습 능력을 발휘함. 구상된 아이디어를 알기 쉽게 표현하는 알마인드맵 프로그램의 기본적인 사용을 할 수 있음. 생활 속의 문제를 발견하고 해결하고자 하는 기본적인 노력을 마인드맵 프로그램으로 적절히 표현함. 맵의 디자인 표현이 잘 되어있고 토픽이 안정감 있게 배치됨."},{"$nulls":3},{"$f":"IF(G77=\"\",\"\",LEN(G77))","v":310}]
[{"$nulls":4},{"$f":"IF(VLOOKUP(C77,평가결과_공통,4,FALSE)=\"\",\"\",IF(메인!$J$7>=2,메인!$F$12,\"\"))","v":"형성평가 - 평가지"},{"$f":"IF(VLOOKUP(C77,평가결과_공통,4,FALSE)=\"\",\"\",VLOOKUP(C77,평가결과_공통,4,FALSE))","v":"A"}]
[{"$nulls":4},{"$f":"IF(VLOOKUP(C77,평가결과_공통,5,FALSE)=\"\",\"\",IF(메인!$J$7>=3,메인!$F$13,\"\"))","v":"포트폴리오 - 학습활동지"},{"$f":"IF(VLOOKUP(C77,평가결과_공통,5,FALSE)=\"\",\"\",VLOOKUP(C77,평가결과_공통,5,FALSE))","v":"B"}]
[{"$nulls":4},{"$f":"IF(VLOOKUP(C77,평가결과_공통,6,FALSE)=\"\",\"\",IF(메인!$J$7>=4,메인!$F$14,\"\"))","v":"마인드 맵 작성"},{"$f":"IF(VLOOKUP(C77,평가결과_공통,6,FALSE)=\"\",\"\",VLOOKUP(C77,평가결과_공통,6,FALSE))","v":"C"}]
[{"$nulls":4},{"$f":"IF(VLOOKUP(C77,평가결과_공통,7,FALSE)=\"\",\"\",IF(메인!$J$7>=5,메인!$F$15,\"\"))","v":""},{"$f":"IF(VLOOKUP(C77,평가결과_공통,7,FALSE)=\"\",\"\",VLOOKUP(C77,평가결과_공통,7,FALSE))","v":""}]
[{"$nulls":4},{"$f":"IF(VLOOKUP(C77,평가결과_공통,8,FALSE)=\"\",\"\",IF(메인!$J$7>=6,메인!$F$16,\"\"))","v":""},{"$f":"IF(VLOOKUP(C77,평가결과_공통,8,FALSE)=\"\",\"\",VLOOKUP(C77,평가결과_공통,8,FALSE))","v":""}]
[{"$nulls":4},{"$f":"IF(VLOOKUP(C77,평가결과_공통,9,FALSE)=\"\",\"\",IF(메인!$J$7>=7,메인!$F$17,\"\"))","v":""},{"$f":"IF(VLOOKUP(C77,평가결과_공통,9,FALSE)=\"\",\"\",VLOOKUP(C77,평가결과_공통,9,FALSE))","v":""}]
[null,null,12,{"$f":"IF(VLOOKUP(C84,학적,2,FALSE)=\"\",\"\",VLOOKUP(C84,학적,2,FALSE))","v":"학생12"},{"$f":"IF(VLOOKUP(C84,평가결과_공통,3,FALSE)=\"\",\"\",IF(메인!$J$7>=1,메인!$F$11,\"\"))","v":"형성평가 - 질문법"},{"$f":"IF(VLOOKUP(C84,평가결과_공통,3,FALSE)=\"\",\"\",VLOOKUP(C84,평가결과_공통,3,FALSE))","v":"B"},{"$f":"IF(OR(D84=\"\",COUNTBLANK(F84:F90)=7),\"\",VLOOKUP(D84,평가_교과!$D$7:$X$46,20,FALSE))","v":"질문의 핵심 내용을 어느정도 알고 답변을 알맞게 잘 하였으며, 단원에 대한 기본 학습 활동이 부족하여 용어와 개념의 이해도가 낮음. 수업활동에 관심을 가지고 학습활동지를 수업과 연계하여 적절히 작성하였으며 교사의 질문에 대한 핵심 내용을 잘 파악하여 적절한 답변을 할 수 있는 학습 능력을 발휘함. 아이디어를 시각적으로 디자인하여 알기 쉽게 표현하는 알마인드맵 프로그램의 고급 기능에 익숙하여 사용을 매우 잘 함. 생활 속의 문제를 발견하고 해결하고자 하는 구체적인 노력을 마인드맵 프로그램으로 매우 잘 표현할 수 있음. 토픽과 서브토픽 내용의 상호 관련성이 매우 적절하며 디자인 요소의 표현이 잘 되어있고 안정감 있게 배치함으로써 전체 맵의 이해도를 높였음."},{"$nulls":3},{"$f":"IF(G84=\"\",\"\",LEN(G84))","v":369}]
[{"$nulls":4},{"$f":"IF(VLOOKUP(C84,평가결과_공통,4,FALSE)=\"\",\"\",IF(메인!$J$7>=2,메인!$F$12,\"\"))","v":"형성평가 - 평가지"},{"$f":"IF(VLOOKUP(C84,평가결과_공통,4,FALSE)=\"\",\"\",VLOOKUP(C84,평가결과_공통,4,FALSE))","v":"C"}]
[{"$nulls":4},{"$f":"IF(VLOOKUP(C84,평가결과_공통,5,FALSE)=\"\",\"\",IF(메인!$J$7>=3,메인!$F$13,\"\"))","v":"포트폴리오 - 학습활동지"},{"$f":"IF(VLOOKUP(C84,평가결과_공통,5,FALSE)=\"\",\"\",VLOOKUP(C84,평가결과_공통,5,FALSE))","v":"B"}]
[{"$nulls":4},{"$f":"IF(VLOOKUP(C84,평가결과_공통,6,FALSE)=\"\",\"\",IF(메인!$J$7>=4,메인!$F$14,\"\"))","v":"마인드 맵 작성"},{"$f":"IF(VLOOKUP(C84,평가결과_공통,6,FALSE)=\"\",\"\",VLOOKUP(C84,평가결과_공통,6,FALSE))","v":"A"}]
[{"$nulls":4},{"$f":"IF(VLOOKUP(C84,평가결과_공통,7,FALSE)=\"\",\"\",IF(메인!$J$7>=5,메인!$F$15,\"\"))","v":""},{"$f":"IF(VLOOKUP(C84,평가결과_공통,7,FALSE)=\"\",\"\",VLOOKUP(C84,평가결과_공통,7,FALSE))","v":""}]
[{"$nulls":4},{"$f":"IF(VLOOKUP(C84,평가결과_공통,8,FALSE)=\"\",\"\",IF(메인!$J$7>=6,메인!$F$16,\"\"))","v":""},{"$f":"IF(VLOOKUP(C84,평가결과_공통,8,FALSE)=\"\",\"\",VLOOKUP(C84,평가결과_공통,8,FALSE))","v":""}]
[{"$nulls":4},{"$f":"IF(VLOOKUP(C84,평가결과_공통,9,FALSE)=\"\",\"\",IF(메인!$J$7>=7,메인!$F$17,\"\"))","v":""},{"$f":"IF(VLOOKUP(C84,평가결과_공통,9,FALSE)=\"\",\"\",VLOOKUP(C84,평가결과_공통,9,FALSE))","v":""}]
[null,null,13,{"$f":"IF(VLOOKUP(C91,학적,2,FALSE)=\"\",\"\",VLOOKUP(C91,학적,2,FALSE))","v":"학생13"},{"$f":"IF(VLOOKUP(C91,평가결과_공통,3,FALSE)=\"\",\"\",IF(메인!$J$7>=1,메인!$F$11,\"\"))","v":"형성평가 - 질문법"},{"$f":"IF(VLOOKUP(C91,평가결과_공통,3,FALSE)=\"\",\"\",VLOOKUP(C91,평가결과_공통,3,FALSE))","v":"C"},{"$f":"IF(OR(D91=\"\",COUNTBLANK(F91:F97)=7),\"\",VLOOKUP(D91,평가_교과!$D$7:$X$46,20,FALSE))","v":"질문의 핵심 내용에 대한 이해가 부족하여 답변의 내용이 부실하였으며, 단원에 대한 기본 학습 활동이 부족하여 용어와 개념의 이해도가 낮음. 수업활동에 기본적인 태도를 가지고 학습활동지를 적절히 작성하였으며 교사의 질문에 대한 내용을 어느정도 파악하여 일부분 답변을 할 수 있는 학습 능력을 발휘함. 시각적으로 아이디어를 디자인하여 알기 쉽게 표현하는 알마인드맵 프로그램의 기본적인 기능을 활용 할 수 있음. 생활 속의 문제를 발견하고 해결하고자 하는 일반적인 노력을 마인드맵 프로그램으로 알맞게 표현함. 토픽과 서브토픽의 디자인 표현이 대체로 잘 되어있고 안정감 있게 배치되었음."},{"$nulls":3},{"$f":"IF(G91=\"\",\"\",LEN(G91))","v":324}]
[{"$nulls":4},{"$f":"IF(VLOOKUP(C91,평가결과_공통,4,FALSE)=\"\",\"\",IF(메인!$J$7>=2,메인!$F$12,\"\"))","v":"형성평가 - 평가지"},{"$f":"IF(VLOOKUP(C91,평가결과_공통,4,FALSE)=\"\",\"\",VLOOKUP(C91,평가결과_공통,4,FALSE))","v":"C"}]
[{"$nulls":4},{"$f":"IF(VLOOKUP(C91,평가결과_공통,5,FALSE)=\"\",\"\",IF(메인!$J$7>=3,메인!$F$13,\"\"))","v":"포트폴리오 - 학습활동지"},{"$f":"IF(VLOOKUP(C91,평가결과_공통,5,FALSE)=\"\",\"\",VLOOKUP(C91,평가결과_공통,5,FALSE))","v":"C"}]
[{"$nulls":4},{"$f":"IF(VLOOKUP(C91,평가결과_공통,6,FALSE)=\"\",\"\",IF(메인!$J$7>=4,메인!$F$14,\"\"))","v":"마인드 맵 작성"},{"$f":"IF(VLOOKUP(C91,평가결과_공통,6,FALSE)=\"\",\"\",VLOOKUP(C91,평가결과_공통,6,FALSE))","v":"B"}]
[{"$nulls":4},{"$f":"IF(VLOOKUP(C91,평가결과_공통,7,FALSE)=\"\",\"\",IF(메인!$J$7>=5,메인!$F$15,\"\"))","v":""},{"$f":"IF(VLOOKUP(C91,평가결과_공통,7,FALSE)=\"\",\"\",VLOOKUP(C91,평가결과_공통,7,FALSE))","v":""}]
[{"$nulls":4},{"$f":"IF(VLOOKUP(C91,평가결과_공통,8,FALSE)=\"\",\"\",IF(메인!$J$7>=6,메인!$F$16,\"\"))","v":""},{"$f":"IF(VLOOKUP(C91,평가결과_공통,8,FALSE)=\"\",\"\",VLOOKUP(C91,평가결과_공통,8,FALSE))","v":""}]
[{"$nulls":4},{"$f":"IF(VLOOKUP(C91,평가결과_공통,9,FALSE)=\"\",\"\",IF(메인!$J$7>=7,메인!$F$17,\"\"))","v":""},{"$f":"IF(VLOOKUP(C91,평가결과_공통,9,FALSE)=\"\",\"\",VLOOKUP(C91,평가결과_공통,9,FALSE))","v":""}]
[null,null,14,{"$f":"IF(VLOOKUP(C98,학적,2,FALSE)=\"\",\"\",VLOOKUP(C98,학적,2,FALSE))","v":"학생14"},{"$f":"IF(VLOOKUP(C98,평가결과_공통,3,FALSE)=\"\",\"\",IF(메인!$J$7>=1,메인!$F$11,\"\"))","v":"형성평가 - 질문법"},{"$f":"IF(VLOOKUP(C98,평가결과_공통,3,FALSE)=\"\",\"\",VLOOKUP(C98,평가결과_공통,3,FALSE))","v":"A"},{"$f":"IF(OR(D98=\"\",COUNTBLANK(F98:F104)=7),\"\",VLOOKUP(D98,평가_교과!$D$7:$X$46,20,FALSE))","v":"질문의 핵심 내용을 분명하게 알고 자신있는 답변을 정확하게 하였으며, 단원에 대한 기본적인 학습활동이 다소 부족하나 일반적인 용어의 개념파악이 양호함. 수업활동에 적극적인 태도를 가지고 학습활동지를 수업과 연계하여 충실히 작성함으로써 교사의 질문에 대한 핵심 내용을 잘 파악하여 정확한 답변을 할 수 있는 학습 능력을 발휘함. 구상된 아이디어를 알기 쉽게 표현하는 알마인드맵 프로그램의 기본적인 사용을 할 수 있음. 생활 속의 문제를 발견하고 해결하고자 하는 기본적인 노력을 마인드맵 프로그램으로 적절히 표현함. 맵의 디자인 표현이 잘 되어있고 토픽이 안정감 있게 배치됨."},{"$nulls":3},{"$f":"IF(G98=\"\",\"\",LEN(G98))","v":320}]
[{"$nulls":4},{"$f":"IF(VLOOKUP(C98,평가결과_공통,4,FALSE)=\"\",\"\",IF(메인!$J$7>=2,메인!$F$12,\"\"))","v":"형성평가 - 평가지"},{"$f":"IF(VLOOKUP(C98,평가결과_공통,4,FALSE)=\"\",\"\",VLOOKUP(C98,평가결과_공통,4,FALSE))","v":"B"}]
[{"$nulls":4},{"$f":"IF(VLOOKUP(C98,평가결과_공통,5,FALSE)=\"\",\"\",IF(메인!$J$7>=3,메인!$F$13,\"\"))","v":"포트폴리오 - 학습활동지"},{"$f":"IF(VLOOKUP(C98,평가결과_공통,5,FALSE)=\"\",\"\",VLOOKUP(C98,평가결과_공통,5,FALSE))","v":"A"}]
[{"$nulls":4},{"$f":"IF(VLOOKUP(C98,평가결과_공통,6,FALSE)=\"\",\"\",IF(메인!$J$7>=4,메인!$F$14,\"\"))","v":"마인드 맵 작성"},{"$f":"IF(VLOOKUP(C98,평가결과_공통,6,FALSE)=\"\",\"\",VLOOKUP(C98,평가결과_공통,6,FALSE))","v":"C"}]
[{"$nulls":4},{"$f":"IF(VLOOKUP(C98,평가결과_공통,7,FALSE)=\"\",\"\",IF(메인!$J$7>=5,메인!$F$15,\"\"))","v":""},{"$f":"IF(VLOOKUP(C98,평가결과_공통,7,FALSE)=\"\",\"\",VLOOKUP(C98,평가결과_공통,7,FALSE))","v":""}]
[{"$nulls":4},{"$f":"IF(VLOOKUP(C98,평가결과_공통,8,FALSE)=\"\",\"\",IF(메인!$J$7>=6,메인!$F$16,\"\"))","v":""},{"$f":"IF(VLOOKUP(C98,평가결과_공통,8,FALSE)=\"\",\"\",VLOOKUP(C98,평가결과_공통,8,FALSE))","v":""}]
[{"$nulls":4},{"$f":"IF(VLOOKUP(C98,평가결과_공통,9,FALSE)=\"\",\"\",IF(메인!$J$7>=7,메인!$F$17,\"\"))","v":""},{"$f":"IF(VLOOKUP(C98,평가결과_공통,9,FALSE)=\"\",\"\",VLOOKUP(C98,평가결과_공통,9,FALSE))","v":""}]
[null,null,15,{"$f":"IF(VLOOKUP(C105,학적,2,FALSE)=\"\",\"\",VLOOKUP(C105,학적,2,FALSE))","v":"학생15"},{"$f":"IF(VLOOKUP(C105,평가결과_공통,3,FALSE)=\"\",\"\",IF(메인!$J$7>=1,메인!$F$11,\"\"))","v":"형성평가 - 질문법"},{"$f":"IF(VLOOKUP(C105,평가결과_공통,3,FALSE)=\"\",\"\",VLOOKUP(C105,평가결과_공통,3,FALSE))","v":"A"},{"$f":"IF(OR(D105=\"\",COUNTBLANK(F105:F111)=7),\"\",VLOOKUP(D105,평가_교과!$D$7:$X$46,20,FALSE))","v":"질문의 핵심 내용을 분명하게 알고 자신있는 답변을 정확하게 하였으며, 단원에 대한 기본적인 학습활동이 잘 되어있어 용어의 이해와 개념 파악이 우수함. 수업활동에 기본적인 태도를 가지고 학습활동지를 적절히 작성하였으며 교사의 질문에 대한 내용을 어느정도 파악하여 일부분 답변을 할 수 있는 학습 능력을 발휘함. 시각적으로 아이디어를 디자인하여 알기 쉽게 표현하는 알마인드맵 프로그램의 기본적인 기능을 활용 할 수 있음. 생활 속의 문제를 발견하고 해결하고자 하는 일반적인 노력을 마인드맵 프로그램으로 알맞게 표현함. 토픽과 서브토픽의 디자인 표현이 대체로 잘 되어있고 안정감 있게 배치되었음."},{"$nulls":3},{"$f":"IF(G105=\"\",\"\",LEN(G105))","v":330}]
[{"$nulls":4},{"$f":"IF(VLOOKUP(C105,평가결과_공통,4,FALSE)=\"\",\"\",IF(메인!$J$7>=2,메인!$F$12,\"\"))","v":"형성평가 - 평가지"},{"$f":"IF(VLOOKUP(C105,평가결과_공통,4,FALSE)=\"\",\"\",VLOOKUP(C105,평가결과_공통,4,FALSE))","v":"A"}]
[{"$nulls":4},{"$f":"IF(VLOOKUP(C105,평가결과_공통,5,FALSE)=\"\",\"\",IF(메인!$J$7>=3,메인!$F$13,\"\"))","v":"포트폴리오 - 학습활동지"},{"$f":"IF(VLOOKUP(C105,평가결과_공통,5,FALSE)=\"\",\"\",VLOOKUP(C105,평가결과_공통,5,FALSE))","v":"C"}]
[{"$nulls":4},{"$f":"IF(VLOOKUP(C105,평가결과_공통,6,FALSE)=\"\",\"\",IF(메인!$J$7>=4,메인!$F$14,\"\"))","v":"마인드 맵 작성"},{"$f":"IF(VLOOKUP(C105,평가결과_공통,6,FALSE)=\"\",\"\",VLOOKUP(C105,평가결과_공통,6,FALSE))","v":"B"}]
[{"$nulls":4},{"$f":"IF(VLOOKUP(C105,평가결과_공통,7,FALSE)=\"\",\"\",IF(메인!$J$7>=5,메인!$F$15,\"\"))","v":""},{"$f":"IF(VLOOKUP(C105,평가결과_공통,7,FALSE)=\"\",\"\",VLOOKUP(C105,평가결과_공통,7,FALSE))","v":""}]
[{"$nulls":4},{"$f":"IF(VLOOKUP(C105,평가결과_공통,8,FALSE)=\"\",\"\",IF(메인!$J$7>=6,메인!$F$16,\"\"))","v":""},{"$f":"IF(VLOOKUP(C105,평가결과_공통,8,FALSE)=\"\",\"\",VLOOKUP(C105,평가결과_공통,8,FALSE))","v":""}]
[{"$nulls":4},{"$f":"IF(VLOOKUP(C105,평가결과_공통,9,FALSE)=\"\",\"\",IF(메인!$J$7>=7,메인!$F$17,\"\"))","v":""},{"$f":"IF(VLOOKUP(C105,평가결과_공통,9,FALSE)=\"\",\"\",VLOOKUP(C105,평가결과_공통,9,FALSE))","v":""}]
[null,null,16,{"$f":"IF(VLOOKUP(C112,학적,2,FALSE)=\"\",\"\",VLOOKUP(C112,학적,2,FALSE))","v":"학생16"},{"$f":"IF(VLOOKUP(C112,평가결과_공통,3,FALSE)=\"\",\"\",IF(메인!$J$7>=1,메인!$F$11,\"\"))","v":"형성평가 - 질문법"},{"$f":"IF(VLOOKUP(C112,평가결과_공통,3,FALSE)=\"\",\"\",VLOOKUP(C112,평가결과_공통,3,FALSE))","v":"B"},{"$f":"IF(OR(D112=\"\",COUNTBLANK(F112:F118)=7),\"\",VLOOKUP(D112,평가_교과!$D$7:$X$46,20,FALSE))","v":"질문의 핵심 내용을 어느정도 알고 답변을 알맞게 잘 하였으며, 단원에 대한 기본적인 학습활동이 다소 부족하나 일반적인 용어의 개념파악이 양호함. 수업활동에 적극적인 태도를 가지고 학습활동지를 수업과 연계하여 충실히 작성함으로써 교사의 질문에 대한 핵심 내용을 잘 파악하여 정확한 답변을 할 수 있는 학습 능력을 발휘함. "},{"$nulls":3},{"$f":"IF(G112=\"\",\"\",LEN(G112))","v":179}]
[{"$nulls":4},{"$f":"IF(VLOOKUP(C112,평가결과_공통,4,FALSE)=\"\",\"\",IF(메인!$J$7>=2,메인!$F$12,\"\"))","v":"형성평가 - 평가지"},{"$f":"IF(VLOOKUP(C112,평가결과_공통,4,FALSE)=\"\",\"\",VLOOKUP(C112,평가결과_공통,4,FALSE))","v":"B"}]
[{"$nulls":4},{"$f":"IF(VLOOKUP(C112,평가결과_공통,5,FALSE)=\"\",\"\",IF(메인!$J$7>=3,메인!$F$13,\"\"))","v":"포트폴리오 - 학습활동지"},{"$f":"IF(VLOOKUP(C112,평가결과_공통,5,FALSE)=\"\",\"\",VLOOKUP(C112,평가결과_공통,5,FALSE))","v":"A"}]
[{"$nulls":4},{"$f":"IF(VLOOKUP(C112,평가결과_공통,6,FALSE)=\"\",\"\",IF(메인!$J$7>=4,메인!$F$14,\"\"))","v":"마인드 맵 작성"},{"$f":"IF(VLOOKUP(C112,평가결과_공통,6,FALSE)=\"\",\"\",VLOOKUP(C112,평가결과_공통,6,FALSE))","v":"전출"}]
[{"$nulls":4},{"$f":"IF(VLOOKUP(C112,평가결과_공통,7,FALSE)=\"\",\"\",IF(메인!$J$7>=5,메인!$F$15,\"\"))","v":""},{"$f":"IF(VLOOKUP(C112,평가결과_공통,7,FALSE)=\"\",\"\",VLOOKUP(C112,평가결과_공통,7,FALSE))","v":""}]
[{"$nulls":4},{"$f":"IF(VLOOKUP(C112,평가결과_공통,8,FALSE)=\"\",\"\",IF(메인!$J$7>=6,메인!$F$16,\"\"))","v":""},{"$f":"IF(VLOOKUP(C112,평가결과_공통,8,FALSE)=\"\",\"\",VLOOKUP(C112,평가결과_공통,8,FALSE))","v":""}]
[{"$nulls":4},{"$f":"IF(VLOOKUP(C112,평가결과_공통,9,FALSE)=\"\",\"\",IF(메인!$J$7>=7,메인!$F$17,\"\"))","v":""},{"$f":"IF(VLOOKUP(C112,평가결과_공통,9,FALSE)=\"\",\"\",VLOOKUP(C112,평가결과_공통,9,FALSE))","v":""}]
[null,null,17,{"$f":"IF(VLOOKUP(C119,학적,2,FALSE)=\"\",\"\",VLOOKUP(C119,학적,2,FALSE))","v":"학생17"},{"$f":"IF(VLOOKUP(C119,평가결과_공통,3,FALSE)=\"\",\"\",IF(메인!$J$7>=1,메인!$F$11,\"\"))","v":"형성평가 - 질문법"},{"$f":"IF(VLOOKUP(C119,평가결과_공통,3,FALSE)=\"\",\"\",VLOOKUP(C119,평가결과_공통,3,FALSE))","v":"B"},{"$f":"IF(OR(D119=\"\",COUNTBLANK(F119:F125)=7),\"\",VLOOKUP(D119,평가_교과!$D$7:$X$46,20,FALSE))","v":"질문의 핵심 내용을 어느정도 알고 답변을 알맞게 잘 하였으며, 단원에 대한 기본 학습 활동이 부족하여 용어와 개념의 이해도가 낮음. 수업활동에 적극적인 태도를 가지고 학습활동지를 수업과 연계하여 충실히 작성함으로써 교사의 질문에 대한 핵심 내용을 잘 파악하여 정확한 답변을 할 수 있는 학습 능력을 발휘함. 시각적으로 아이디어를 디자인하여 알기 쉽게 표현하는 알마인드맵 프로그램의 기본적인 기능을 활용 할 수 있음. 생활 속의 문제를 발견하고 해결하고자 하는 일반적인 노력을 마인드맵 프로그램으로 알맞게 표현함. 토픽과 서브토픽의 디자인 표현이 대체로 잘 되어있고 안정감 있게 배치되었음."},{"$nulls":3},{"$f":"IF(G119=\"\",\"\",LEN(G119))","v":329}]
[{"$nulls":4},{"$f":"IF(VLOOKUP(C119,평가결과_공통,4,FALSE)=\"\",\"\",IF(메인!$J$7>=2,메인!$F$12,\"\"))","v":"형성평가 - 평가지"},{"$f":"IF(VLOOKUP(C119,평가결과_공통,4,FALSE)=\"\",\"\",VLOOKUP(C119,평가결과_공통,4,FALSE))","v":"C"}]
[{"$nulls":4},{"$f":"IF(VLOOKUP(C119,평가결과_공통,5,FALSE)=\"\",\"\",IF(메인!$J$7>=3,메인!$F$13,\"\"))","v":"포트폴리오 - 학습활동지"},{"$f":"IF(VLOOKUP(C119,평가결과_공통,5,FALSE)=\"\",\"\",VLOOKUP(C119,평가결과_공통,5,FALSE))","v":"A"}]
[{"$nulls":4},{"$f":"IF(VLOOKUP(C119,평가결과_공통,6,FALSE)=\"\",\"\",IF(메인!$J$7>=4,메인!$F$14,\"\"))","v":"마인드 맵 작성"},{"$f":"IF(VLOOKUP(C119,평가결과_공통,6,FALSE)=\"\",\"\",VLOOKUP(C119,평가결과_공통,6,FALSE))","v":"B"}]
[{"$nulls":4},{"$f":"IF(VLOOKUP(C119,평가결과_공통,7,FALSE)=\"\",\"\",IF(메인!$J$7>=5,메인!$F$15,\"\"))","v":""},{"$f":"IF(VLOOKUP(C119,평가결과_공통,7,FALSE)=\"\",\"\",VLOOKUP(C119,평가결과_공통,7,FALSE))","v":""}]
[{"$nulls":4},{"$f":"IF(VLOOKUP(C119,평가결과_공통,8,FALSE)=\"\",\"\",IF(메인!$J$7>=6,메인!$F$16,\"\"))","v":""},{"$f":"IF(VLOOKUP(C119,평가결과_공통,8,FALSE)=\"\",\"\",VLOOKUP(C119,평가결과_공통,8,FALSE))","v":""}]
[{"$nulls":4},{"$f":"IF(VLOOKUP(C119,평가결과_공통,9,FALSE)=\"\",\"\",IF(메인!$J$7>=7,메인!$F$17,\"\"))","v":""},{"$f":"IF(VLOOKUP(C119,평가결과_공통,9,FALSE)=\"\",\"\",VLOOKUP(C119,평가결과_공통,9,FALSE))","v":""}]
[null,null,18,{"$f":"IF(VLOOKUP(C126,학적,2,FALSE)=\"\",\"\",VLOOKUP(C126,학적,2,FALSE))","v":"학생18"},{"$f":"IF(VLOOKUP(C126,평가결과_공통,3,FALSE)=\"\",\"\",IF(메인!$J$7>=1,메인!$F$11,\"\"))","v":"형성평가 - 질문법"},{"$f":"IF(VLOOKUP(C126,평가결과_공통,3,FALSE)=\"\",\"\",VLOOKUP(C126,평가결과_공통,3,FALSE))","v":"A"},{"$f":"IF(OR(D126=\"\",COUNTBLANK(F126:F132)=7),\"\",VLOOKUP(D126,평가_교과!$D$7:$X$46,20,FALSE))","v":"질문의 핵심 내용을 분명하게 알고 자신있는 답변을 정확하게 하였으며, 단원에 대한 기본적인 학습활동이 잘 되어있어 용어의 이해와 개념 파악이 우수함. 수업활동에 관심을 가지고 학습활동지를 수업과 연계하여 적절히 작성하였으며 교사의 질문에 대한 핵심 내용을 잘 파악하여 적절한 답변을 할 수 있는 학습 능력을 발휘함. 아이디어를 시각적으로 디자인하여 알기 쉽게 표현하는 알마인드맵 프로그램의 고급 기능에 익숙하여 사용을 매우 잘 함. 생활 속의 문제를 발견하고 해결하고자 하는 구체적인 노력을 마인드맵 프로그램으로 매우 잘 표현할 수 있음. 토픽과 서브토픽 내용의 상호 관련성이 매우 적절하며 디자인 요소의 표현이 잘 되어있고 안정감 있게 배치함으로써 전체 맵의 이해도를 높였음."},{"$nulls":3},{"$f":"IF(G126=\"\",\"\",LEN(G126))","v":379}]
[{"$nulls":4},{"$f":"IF(VLOOKUP(C126,평가결과_공통,4,FALSE)=\"\",\"\",IF(메인!$J$7>=2,메인!$F$12,\"\"))","v":"형성평가 - 평가지"},{"$f":"IF(VLOOKUP(C126,평가결과_공통,4,FALSE)=\"\",\"\",VLOOKUP(C126,평가결과_공통,4,FALSE))","v":"A"}]
[{"$nulls":4},{"$f":"IF(VLOOKUP(C126,평가결과_공통,5,FALSE)=\"\",\"\",IF(메인!$J$7>=3,메인!$F$13,\"\"))","v":"포트폴리오 - 학습활동지"},{"$f":"IF(VLOOKUP(C126,평가결과_공통,5,FALSE)=\"\",\"\",VLOOKUP(C126,평가결과_공통,5,FALSE))","v":"B"}]
[{"$nulls":4},{"$f":"IF(VLOOKUP(C126,평가결과_공통,6,FALSE)=\"\",\"\",IF(메인!$J$7>=4,메인!$F$14,\"\"))","v":"마인드 맵 작성"},{"$f":"IF(VLOOKUP(C126,평가결과_공통,6,FALSE)=\"\",\"\",VLOOKUP(C126,평가결과_공통,6,FALSE))","v":"A"}]
[{"$nulls":4},{"$f":"IF(VLOOKUP(C126,평가결과_공통,7,FALSE)=\"\",\"\",IF(메인!$J$7>=5,메인!$F$15,\"\"))","v":""},{"$f":"IF(VLOOKUP(C126,평가결과_공통,7,FALSE)=\"\",\"\",VLOOKUP(C126,평가결과_공통,7,FALSE))","v":""}]
[{"$nulls":4},{"$f":"IF(VLOOKUP(C126,평가결과_공통,8,FALSE)=\"\",\"\",IF(메인!$J$7>=6,메인!$F$16,\"\"))","v":""},{"$f":"IF(VLOOKUP(C126,평가결과_공통,8,FALSE)=\"\",\"\",VLOOKUP(C126,평가결과_공통,8,FALSE))","v":""}]
[{"$nulls":4},{"$f":"IF(VLOOKUP(C126,평가결과_공통,9,FALSE)=\"\",\"\",IF(메인!$J$7>=7,메인!$F$17,\"\"))","v":""},{"$f":"IF(VLOOKUP(C126,평가결과_공통,9,FALSE)=\"\",\"\",VLOOKUP(C126,평가결과_공통,9,FALSE))","v":""}]
[null,null,19,{"$f":"IF(VLOOKUP(C133,학적,2,FALSE)=\"\",\"\",VLOOKUP(C133,학적,2,FALSE))","v":"학생19"},{"$f":"IF(VLOOKUP(C133,평가결과_공통,3,FALSE)=\"\",\"\",IF(메인!$J$7>=1,메인!$F$11,\"\"))","v":"형성평가 - 질문법"},{"$f":"IF(VLOOKUP(C133,평가결과_공통,3,FALSE)=\"\",\"\",VLOOKUP(C133,평가결과_공통,3,FALSE))","v":"A"},{"$f":"IF(OR(D133=\"\",COUNTBLANK(F133:F139)=7),\"\",VLOOKUP(D133,평가_교과!$D$7:$X$46,20,FALSE))","v":"질문의 핵심 내용을 분명하게 알고 자신있는 답변을 정확하게 하였으며, 단원에 대한 기본적인 학습활동이 다소 부족하나 일반적인 용어의 개념파악이 양호함. 수업활동에 기본적인 태도를 가지고 학습활동지를 적절히 작성하였으며 교사의 질문에 대한 내용을 어느정도 파악하여 일부분 답변을 할 수 있는 학습 능력을 발휘함. 구상된 아이디어를 알기 쉽게 표현하는 알마인드맵 프로그램의 기본적인 사용을 할 수 있음. 생활 속의 문제를 발견하고 해결하고자 하는 기본적인 노력을 마인드맵 프로그램으로 적절히 표현함. 맵의 디자인 표현이 잘 되어있고 토픽이 안정감 있게 배치됨."},{"$nulls":3},{"$f":"IF(G133=\"\",\"\",LEN(G133))","v":311}]
[{"$nulls":4},{"$f":"IF(VLOOKUP(C133,평가결과_공통,4,FALSE)=\"\",\"\",IF(메인!$J$7>=2,메인!$F$12,\"\"))","v":"형성평가 - 평가지"},{"$f":"IF(VLOOKUP(C133,평가결과_공통,4,FALSE)=\"\",\"\",VLOOKUP(C133,평가결과_공통,4,FALSE))","v":"B"}]
[{"$nulls":4},{"$f":"IF(VLOOKUP(C133,평가결과_공통,5,FALSE)=\"\",\"\",IF(메인!$J$7>=3,메인!$F$13,\"\"))","v":"포트폴리오 - 학습활동지"},{"$f":"IF(VLOOKUP(C133,평가결과_공통,5,FALSE)=\"\",\"\",VLOOKUP(C133,평가결과_공통,5,FALSE))","v":"C"}]
[{"$nulls":4},{"$f":"IF(VLOOKUP(C133,평가결과_공통,6,FALSE)=\"\",\"\",IF(메인!$J$7>=4,메인!$F$14,\"\"))","v":"마인드 맵 작성"},{"$f":"IF(VLOOKUP(C133,평가결과_공통,6,FALSE)=\"\",\"\",VLOOKUP(C133,평가결과_공통,6,FALSE))","v":"C"}]
[{"$nulls":4},{"$f":"IF(VLOOKUP(C133,평가결과_공통,7,FALSE)=\"\",\"\",IF(메인!$J$7>=5,메인!$F$15,\"\"))","v":""},{"$f":"IF(VLOOKUP(C133,평가결과_공통,7,FALSE)=\"\",\"\",VLOOKUP(C133,평가결과_공통,7,FALSE))","v":""}]
[{"$nulls":4},{"$f":"IF(VLOOKUP(C133,평가결과_공통,8,FALSE)=\"\",\"\",IF(메인!$J$7>=6,메인!$F$16,\"\"))","v":""},{"$f":"IF(VLOOKUP(C133,평가결과_공통,8,FALSE)=\"\",\"\",VLOOKUP(C133,평가결과_공통,8,FALSE))","v":""}]
[{"$nulls":4},{"$f":"IF(VLOOKUP(C133,평가결과_공통,9,FALSE)=\"\",\"\",IF(메인!$J$7>=7,메인!$F$17,\"\"))","v":""},{"$f":"IF(VLOOKUP(C133,평가결과_공통,9,FALSE)=\"\",\"\",VLOOKUP(C133,평가결과_공통,9,FALSE))","v":""}]
[null,null,20,{"$f":"IF(VLOOKUP(C140,학적,2,FALSE)=\"\",\"\",VLOOKUP(C140,학적,2,FALSE))","v":"학생20"},{"$f":"IF(VLOOKUP(C140,평가결과_공통,3,FALSE)=\"\",\"\",IF(메인!$J$7>=1,메인!$F$11,\"\"))","v":"형성평가 - 질문법"},{"$f":"IF(VLOOKUP(C140,평가결과_공통,3,FALSE)=\"\",\"\",VLOOKUP(C140,평가결과_공통,3,FALSE))","v":"B"},{"$f":"IF(OR(D140=\"\",COUNTBLANK(F140:F146)=7),\"\",VLOOKUP(D140,평가_교과!$D$7:$X$46,20,FALSE))","v":"질문의 핵심 내용을 어느정도 알고 답변을 알맞게 잘 하였으며, 단원에 대한 기본적인 학습활동이 다소 부족하나 일반적인 용어의 개념파악이 양호함. 수업활동에 적극적인 태도를 가지고 학습활동지를 수업과 연계하여 충실히 작성함으로써 교사의 질문에 대한 핵심 내용을 잘 파악하여 정확한 답변을 할 수 있는 학습 능력을 발휘함. 아이디어를 시각적으로 디자인하여 알기 쉽게 표현하는 알마인드맵 프로그램의 고급 기능에 익숙하여 사용을 매우 잘 함. 생활 속의 문제를 발견하고 해결하고자 하는 구체적인 노력을 마인드맵 프로그램으로 매우 잘 표현할 수 있음. 토픽과 서브토픽 내용의 상호 관련성이 매우 적절하며 디자인 요소의 표현이 잘 되어있고 안정감 있게 배치함으로써 전체 맵의 이해도를 높였음."},{"$nulls":3},{"$f":"IF(G140=\"\",\"\",LEN(G140))","v":381}]
[{"$nulls":4},{"$f":"IF(VLOOKUP(C140,평가결과_공통,4,FALSE)=\"\",\"\",IF(메인!$J$7>=2,메인!$F$12,\"\"))","v":"형성평가 - 평가지"},{"$f":"IF(VLOOKUP(C140,평가결과_공통,4,FALSE)=\"\",\"\",VLOOKUP(C140,평가결과_공통,4,FALSE))","v":"B"}]
[{"$nulls":4},{"$f":"IF(VLOOKUP(C140,평가결과_공통,5,FALSE)=\"\",\"\",IF(메인!$J$7>=3,메인!$F$13,\"\"))","v":"포트폴리오 - 학습활동지"},{"$f":"IF(VLOOKUP(C140,평가결과_공통,5,FALSE)=\"\",\"\",VLOOKUP(C140,평가결과_공통,5,FALSE))","v":"A"}]
[{"$nulls":4},{"$f":"IF(VLOOKUP(C140,평가결과_공통,6,FALSE)=\"\",\"\",IF(메인!$J$7>=4,메인!$F$14,\"\"))","v":"마인드 맵 작성"},{"$f":"IF(VLOOKUP(C140,평가결과_공통,6,FALSE)=\"\",\"\",VLOOKUP(C140,평가결과_공통,6,FALSE))","v":"A"}]
[{"$nulls":4},{"$f":"IF(VLOOKUP(C140,평가결과_공통,7,FALSE)=\"\",\"\",IF(메인!$J$7>=5,메인!$F$15,\"\"))","v":""},{"$f":"IF(VLOOKUP(C140,평가결과_공통,7,FALSE)=\"\",\"\",VLOOKUP(C140,평가결과_공통,7,FALSE))","v":""}]
[{"$nulls":4},{"$f":"IF(VLOOKUP(C140,평가결과_공통,8,FALSE)=\"\",\"\",IF(메인!$J$7>=6,메인!$F$16,\"\"))","v":""},{"$f":"IF(VLOOKUP(C140,평가결과_공통,8,FALSE)=\"\",\"\",VLOOKUP(C140,평가결과_공통,8,FALSE))","v":""}]
[{"$nulls":4},{"$f":"IF(VLOOKUP(C140,평가결과_공통,9,FALSE)=\"\",\"\",IF(메인!$J$7>=7,메인!$F$17,\"\"))","v":""},{"$f":"IF(VLOOKUP(C140,평가결과_공통,9,FALSE)=\"\",\"\",VLOOKUP(C140,평가결과_공통,9,FALSE))","v":""}]
[null,null,21,{"$f":"IF(VLOOKUP(C147,학적,2,FALSE)=\"\",\"\",VLOOKUP(C147,학적,2,FALSE))","v":"학생21"},{"$f":"IF(VLOOKUP(C147,평가결과_공통,3,FALSE)=\"\",\"\",IF(메인!$J$7>=1,메인!$F$11,\"\"))","v":"형성평가 - 질문법"},{"$f":"IF(VLOOKUP(C147,평가결과_공통,3,FALSE)=\"\",\"\",VLOOKUP(C147,평가결과_공통,3,FALSE))","v":"A"},{"$f":"IF(OR(D147=\"\",COUNTBLANK(F147:F153)=7),\"\",VLOOKUP(D147,평가_교과!$D$7:$X$46,20,FALSE))","v":"질문의 핵심 내용을 분명하게 알고 자신있는 답변을 정확하게 하였으며, 단원에 대한 기본적인 학습활동이 잘 되어있어 용어의 이해와 개념 파악이 우수함. 수업활동에 관심을 가지고 학습활동지를 수업과 연계하여 적절히 작성하였으며 교사의 질문에 대한 핵심 내용을 잘 파악하여 적절한 답변을 할 수 있는 학습 능력을 발휘함. 아이디어를 시각적으로 디자인하여 알기 쉽게 표현하는 알마인드맵 프로그램의 고급 기능에 익숙하여 사용을 매우 잘 함. 생활 속의 문제를 발견하고 해결하고자 하는 구체적인 노력을 마인드맵 프로그램으로 매우 잘 표현할 수 있음. 토픽과 서브토픽 내용의 상호 관련성이 매우 적절하며 디자인 요소의 표현이 잘 되어있고 안정감 있게 배치함으로써 전체 맵의 이해도를 높였음."},{"$nulls":3},{"$f":"IF(G147=\"\",\"\",LEN(G147))","v":379}]
[{"$nulls":4},{"$f":"IF(VLOOKUP(C147,평가결과_공통,4,FALSE)=\"\",\"\",IF(메인!$J$7>=2,메인!$F$12,\"\"))","v":"형성평가 - 평가지"},{"$f":"IF(VLOOKUP(C147,평가결과_공통,4,FALSE)=\"\",\"\",VLOOKUP(C147,평가결과_공통,4,FALSE))","v":"A"}]
[{"$nulls":4},{"$f":"IF(VLOOKUP(C147,평가결과_공통,5,FALSE)=\"\",\"\",IF(메인!$J$7>=3,메인!$F$13,\"\"))","v":"포트폴리오 - 학습활동지"},{"$f":"IF(VLOOKUP(C147,평가결과_공통,5,FALSE)=\"\",\"\",VLOOKUP(C147,평가결과_공통,5,FALSE))","v":"B"}]
[{"$nulls":4},{"$f":"IF(VLOOKUP(C147,평가결과_공통,6,FALSE)=\"\",\"\",IF(메인!$J$7>=4,메인!$F$14,\"\"))","v":"마인드 맵 작성"},{"$f":"IF(VLOOKUP(C147,평가결과_공통,6,FALSE)=\"\",\"\",VLOOKUP(C147,평가결과_공통,6,FALSE))","v":"A"}]
[{"$nulls":4},{"$f":"IF(VLOOKUP(C147,평가결과_공통,7,FALSE)=\"\",\"\",IF(메인!$J$7>=5,메인!$F$15,\"\"))","v":""},{"$f":"IF(VLOOKUP(C147,평가결과_공통,7,FALSE)=\"\",\"\",VLOOKUP(C147,평가결과_공통,7,FALSE))","v":""}]
[{"$nulls":4},{"$f":"IF(VLOOKUP(C147,평가결과_공통,8,FALSE)=\"\",\"\",IF(메인!$J$7>=6,메인!$F$16,\"\"))","v":""},{"$f":"IF(VLOOKUP(C147,평가결과_공통,8,FALSE)=\"\",\"\",VLOOKUP(C147,평가결과_공통,8,FALSE))","v":""}]
[{"$nulls":4},{"$f":"IF(VLOOKUP(C147,평가결과_공통,9,FALSE)=\"\",\"\",IF(메인!$J$7>=7,메인!$F$17,\"\"))","v":""},{"$f":"IF(VLOOKUP(C147,평가결과_공통,9,FALSE)=\"\",\"\",VLOOKUP(C147,평가결과_공통,9,FALSE))","v":""}]
[null,null,22,{"$f":"IF(VLOOKUP(C154,학적,2,FALSE)=\"\",\"\",VLOOKUP(C154,학적,2,FALSE))","v":"학생22"},{"$f":"IF(VLOOKUP(C154,평가결과_공통,3,FALSE)=\"\",\"\",IF(메인!$J$7>=1,메인!$F$11,\"\"))","v":"형성평가 - 질문법"},{"$f":"IF(VLOOKUP(C154,평가결과_공통,3,FALSE)=\"\",\"\",VLOOKUP(C154,평가결과_공통,3,FALSE))","v":"B"},{"$f":"IF(OR(D154=\"\",COUNTBLANK(F154:F160)=7),\"\",VLOOKUP(D154,평가_교과!$D$7:$X$46,20,FALSE))","v":"질문의 핵심 내용을 어느정도 알고 답변을 알맞게 잘 하였으며, 단원에 대한 기본적인 학습활동이 잘 되어있어 용어의 이해와 개념 파악이 우수함. 수업활동에 기본적인 태도를 가지고 학습활동지를 적절히 작성하였으며 교사의 질문에 대한 내용을 어느정도 파악하여 일부분 답변을 할 수 있는 학습 능력을 발휘함. 시각적으로 아이디어를 디자인하여 알기 쉽게 표현하는 알마인드맵 프로그램의 기본적인 기능을 활용 할 수 있음. 생활 속의 문제를 발견하고 해결하고자 하는 일반적인 노력을 마인드맵 프로그램으로 알맞게 표현함. 토픽과 서브토픽의 디자인 표현이 대체로 잘 되어있고 안정감 있게 배치되었음."},{"$nulls":3},{"$f":"IF(G154=\"\",\"\",LEN(G154))","v":326}]
[{"$nulls":4},{"$f":"IF(VLOOKUP(C154,평가결과_공통,4,FALSE)=\"\",\"\",IF(메인!$J$7>=2,메인!$F$12,\"\"))","v":"형성평가 - 평가지"},{"$f":"IF(VLOOKUP(C154,평가결과_공통,4,FALSE)=\"\",\"\",VLOOKUP(C154,평가결과_공통,4,FALSE))","v":"A"}]
[{"$nulls":4},{"$f":"IF(VLOOKUP(C154,평가결과_공통,5,FALSE)=\"\",\"\",IF(메인!$J$7>=3,메인!$F$13,\"\"))","v":"포트폴리오 - 학습활동지"},{"$f":"IF(VLOOKUP(C154,평가결과_공통,5,FALSE)=\"\",\"\",VLOOKUP(C154,평가결과_공통,5,FALSE))","v":"C"}]
[{"$nulls":4},{"$f":"IF(VLOOKUP(C154,평가결과_공통,6,FALSE)=\"\",\"\",IF(메인!$J$7>=4,메인!$F$14,\"\"))","v":"마인드 맵 작성"},{"$f":"IF(VLOOKUP(C154,평가결과_공통,6,FALSE)=\"\",\"\",VLOOKUP(C154,평가결과_공통,6,FALSE))","v":"B"}]
[{"$nulls":4},{"$f":"IF(VLOOKUP(C154,평가결과_공통,7,FALSE)=\"\",\"\",IF(메인!$J$7>=5,메인!$F$15,\"\"))","v":""},{"$f":"IF(VLOOKUP(C154,평가결과_공통,7,FALSE)=\"\",\"\",VLOOKUP(C154,평가결과_공통,7,FALSE))","v":""}]
[{"$nulls":4},{"$f":"IF(VLOOKUP(C154,평가결과_공통,8,FALSE)=\"\",\"\",IF(메인!$J$7>=6,메인!$F$16,\"\"))","v":""},{"$f":"IF(VLOOKUP(C154,평가결과_공통,8,FALSE)=\"\",\"\",VLOOKUP(C154,평가결과_공통,8,FALSE))","v":""}]
[{"$nulls":4},{"$f":"IF(VLOOKUP(C154,평가결과_공통,9,FALSE)=\"\",\"\",IF(메인!$J$7>=7,메인!$F$17,\"\"))","v":""},{"$f":"IF(VLOOKUP(C154,평가결과_공통,9,FALSE)=\"\",\"\",VLOOKUP(C154,평가결과_공통,9,FALSE))","v":""}]
[null,null,23,{"$f":"IF(VLOOKUP(C161,학적,2,FALSE)=\"\",\"\",VLOOKUP(C161,학적,2,FALSE))","v":"학생23"},{"$f":"IF(VLOOKUP(C161,평가결과_공통,3,FALSE)=\"\",\"\",IF(메인!$J$7>=1,메인!$F$11,\"\"))","v":"형성평가 - 질문법"},{"$f":"IF(VLOOKUP(C161,평가결과_공통,3,FALSE)=\"\",\"\",VLOOKUP(C161,평가결과_공통,3,FALSE))","v":"A"},{"$f":"IF(OR(D161=\"\",COUNTBLANK(F161:F167)=7),\"\",VLOOKUP(D161,평가_교과!$D$7:$X$46,20,FALSE))","v":"질문의 핵심 내용을 분명하게 알고 자신있는 답변을 정확하게 하였으며, 단원에 대한 기본적인 학습활동이 잘 되어있어 용어의 이해와 개념 파악이 우수함. 수업활동에 적극적인 태도를 가지고 학습활동지를 수업과 연계하여 충실히 작성함으로써 교사의 질문에 대한 핵심 내용을 잘 파악하여 정확한 답변을 할 수 있는 학습 능력을 발휘함. 시각적으로 아이디어를 디자인하여 알기 쉽게 표현하는 알마인드맵 프로그램의 기본적인 기능을 활용 할 수 있음. 생활 속의 문제를 발견하고 해결하고자 하는 일반적인 노력을 마인드맵 프로그램으로 알맞게 표현함. 토픽과 서브토픽의 디자인 표현이 대체로 잘 되어있고 안정감 있게 배치되었음."},{"$nulls":3},{"$f":"IF(G161=\"\",\"\",LEN(G161))","v":339}]
[{"$nulls":4},{"$f":"IF(VLOOKUP(C161,평가결과_공통,4,FALSE)=\"\",\"\",IF(메인!$J$7>=2,메인!$F$12,\"\"))","v":"형성평가 - 평가지"},{"$f":"IF(VLOOKUP(C161,평가결과_공통,4,FALSE)=\"\",\"\",VLOOKUP(C161,평가결과_공통,4,FALSE))","v":"A"}]
[{"$nulls":4},{"$f":"IF(VLOOKUP(C161,평가결과_공통,5,FALSE)=\"\",\"\",IF(메인!$J$7>=3,메인!$F$13,\"\"))","v":"포트폴리오 - 학습활동지"},{"$f":"IF(VLOOKUP(C161,평가결과_공통,5,FALSE)=\"\",\"\",VLOOKUP(C161,평가결과_공통,5,FALSE))","v":"A"}]
[{"$nulls":4},{"$f":"IF(VLOOKUP(C161,평가결과_공통,6,FALSE)=\"\",\"\",IF(메인!$J$7>=4,메인!$F$14,\"\"))","v":"마인드 맵 작성"},{"$f":"IF(VLOOKUP(C161,평가결과_공통,6,FALSE)=\"\",\"\",VLOOKUP(C161,평가결과_공통,6,FALSE))","v":"B"}]
[{"$nulls":4},{"$f":"IF(VLOOKUP(C161,평가결과_공통,7,FALSE)=\"\",\"\",IF(메인!$J$7>=5,메인!$F$15,\"\"))","v":""},{"$f":"IF(VLOOKUP(C161,평가결과_공통,7,FALSE)=\"\",\"\",VLOOKUP(C161,평가결과_공통,7,FALSE))","v":""}]
[{"$nulls":4},{"$f":"IF(VLOOKUP(C161,평가결과_공통,8,FALSE)=\"\",\"\",IF(메인!$J$7>=6,메인!$F$16,\"\"))","v":""},{"$f":"IF(VLOOKUP(C161,평가결과_공통,8,FALSE)=\"\",\"\",VLOOKUP(C161,평가결과_공통,8,FALSE))","v":""}]
[{"$nulls":4},{"$f":"IF(VLOOKUP(C161,평가결과_공통,9,FALSE)=\"\",\"\",IF(메인!$J$7>=7,메인!$F$17,\"\"))","v":""},{"$f":"IF(VLOOKUP(C161,평가결과_공통,9,FALSE)=\"\",\"\",VLOOKUP(C161,평가결과_공통,9,FALSE))","v":""}]
[null,null,24,{"$f":"IF(VLOOKUP(C168,학적,2,FALSE)=\"\",\"\",VLOOKUP(C168,학적,2,FALSE))","v":"학생24"},{"$f":"IF(VLOOKUP(C168,평가결과_공통,3,FALSE)=\"\",\"\",IF(메인!$J$7>=1,메인!$F$11,\"\"))","v":"형성평가 - 질문법"},{"$f":"IF(VLOOKUP(C168,평가결과_공통,3,FALSE)=\"\",\"\",VLOOKUP(C168,평가결과_공통,3,FALSE))","v":"A"},{"$f":"IF(OR(D168=\"\",COUNTBLANK(F168:F174)=7),\"\",VLOOKUP(D168,평가_교과!$D$7:$X$46,20,FALSE))","v":"질문의 핵심 내용을 분명하게 알고 자신있는 답변을 정확하게 하였으며, 단원에 대한 기본적인 학습활동이 잘 되어있어 용어의 이해와 개념 파악이 우수함. 수업활동에 적극적인 태도를 가지고 학습활동지를 수업과 연계하여 충실히 작성함으로써 교사의 질문에 대한 핵심 내용을 잘 파악하여 정확한 답변을 할 수 있는 학습 능력을 발휘함. 아이디어를 시각적으로 디자인하여 알기 쉽게 표현하는 알마인드맵 프로그램의 고급 기능에 익숙하여 사용을 매우 잘 함. 생활 속의 문제를 발견하고 해결하고자 하는 구체적인 노력을 마인드맵 프로그램으로 매우 잘 표현할 수 있음. 토픽과 서브토픽 내용의 상호 관련성이 매우 적절하며 디자인 요소의 표현이 잘 되어있고 안정감 있게 배치함으로써 전체 맵의 이해도를 높였음."},{"$nulls":3},{"$f":"IF(G168=\"\",\"\",LEN(G168))","v":384}]
[{"$nulls":4},{"$f":"IF(VLOOKUP(C168,평가결과_공통,4,FALSE)=\"\",\"\",IF(메인!$J$7>=2,메인!$F$12,\"\"))","v":"형성평가 - 평가지"},{"$f":"IF(VLOOKUP(C168,평가결과_공통,4,FALSE)=\"\",\"\",VLOOKUP(C168,평가결과_공통,4,FALSE))","v":"A"}]
[{"$nulls":4},{"$f":"IF(VLOOKUP(C168,평가결과_공통,5,FALSE)=\"\",\"\",IF(메인!$J$7>=3,메인!$F$13,\"\"))","v":"포트폴리오 - 학습활동지"},{"$f":"IF(VLOOKUP(C168,평가결과_공통,5,FALSE)=\"\",\"\",VLOOKUP(C168,평가결과_공통,5,FALSE))","v":"A"}]
[{"$nulls":4},{"$f":"IF(VLOOKUP(C168,평가결과_공통,6,FALSE)=\"\",\"\",IF(메인!$J$7>=4,메인!$F$14,\"\"))","v":"마인드 맵 작성"},{"$f":"IF(VLOOKUP(C168,평가결과_공통,6,FALSE)=\"\",\"\",VLOOKUP(C168,평가결과_공통,6,FALSE))","v":"A"}]
[{"$nulls":4},{"$f":"IF(VLOOKUP(C168,평가결과_공통,7,FALSE)=\"\",\"\",IF(메인!$J$7>=5,메인!$F$15,\"\"))","v":""},{"$f":"IF(VLOOKUP(C168,평가결과_공통,7,FALSE)=\"\",\"\",VLOOKUP(C168,평가결과_공통,7,FALSE))","v":""}]
[{"$nulls":4},{"$f":"IF(VLOOKUP(C168,평가결과_공통,8,FALSE)=\"\",\"\",IF(메인!$J$7>=6,메인!$F$16,\"\"))","v":""},{"$f":"IF(VLOOKUP(C168,평가결과_공통,8,FALSE)=\"\",\"\",VLOOKUP(C168,평가결과_공통,8,FALSE))","v":""}]
[{"$nulls":4},{"$f":"IF(VLOOKUP(C168,평가결과_공통,9,FALSE)=\"\",\"\",IF(메인!$J$7>=7,메인!$F$17,\"\"))","v":""},{"$f":"IF(VLOOKUP(C168,평가결과_공통,9,FALSE)=\"\",\"\",VLOOKUP(C168,평가결과_공통,9,FALSE))","v":""}]
[null,null,25,{"$f":"IF(VLOOKUP(C175,학적,2,FALSE)=\"\",\"\",VLOOKUP(C175,학적,2,FALSE))","v":"학생25"},{"$f":"IF(VLOOKUP(C175,평가결과_공통,3,FALSE)=\"\",\"\",IF(메인!$J$7>=1,메인!$F$11,\"\"))","v":"형성평가 - 질문법"},{"$f":"IF(VLOOKUP(C175,평가결과_공통,3,FALSE)=\"\",\"\",VLOOKUP(C175,평가결과_공통,3,FALSE))","v":"전입"},{"$f":"IF(OR(D175=\"\",COUNTBLANK(F175:F181)=7),\"\",VLOOKUP(D175,평가_교과!$D$7:$X$46,20,FALSE))","v":" 단원에 대한 기본적인 학습활동이 다소 부족하나 일반적인 용어의 개념파악이 양호함. 수업활동에 기본적인 태도를 가지고 학습활동지를 적절히 작성하였으며 교사의 질문에 대한 내용을 어느정도 파악하여 일부분 답변을 할 수 있는 학습 능력을 발휘함. 시각적으로 아이디어를 디자인하여 알기 쉽게 표현하는 알마인드맵 프로그램의 기본적인 기능을 활용 할 수 있음. 생활 속의 문제를 발견하고 해결하고자 하는 일반적인 노력을 마인드맵 프로그램으로 알맞게 표현함. 토픽과 서브토픽의 디자인 표현이 대체로 잘 되어있고 안정감 있게 배치되었음."},{"$nulls":3},{"$f":"IF(G175=\"\",\"\",LEN(G175))","v":293}]
[{"$nulls":4},{"$f":"IF(VLOOKUP(C175,평가결과_공통,4,FALSE)=\"\",\"\",IF(메인!$J$7>=2,메인!$F$12,\"\"))","v":"형성평가 - 평가지"},{"$f":"IF(VLOOKUP(C175,평가결과_공통,4,FALSE)=\"\",\"\",VLOOKUP(C175,평가결과_공통,4,FALSE))","v":"B"}]
[{"$nulls":4},{"$f":"IF(VLOOKUP(C175,평가결과_공통,5,FALSE)=\"\",\"\",IF(메인!$J$7>=3,메인!$F$13,\"\"))","v":"포트폴리오 - 학습활동지"},{"$f":"IF(VLOOKUP(C175,평가결과_공통,5,FALSE)=\"\",\"\",VLOOKUP(C175,평가결과_공통,5,FALSE))","v":"C"}]
[{"$nulls":4},{"$f":"IF(VLOOKUP(C175,평가결과_공통,6,FALSE)=\"\",\"\",IF(메인!$J$7>=4,메인!$F$14,\"\"))","v":"마인드 맵 작성"},{"$f":"IF(VLOOKUP(C175,평가결과_공통,6,FALSE)=\"\",\"\",VLOOKUP(C175,평가결과_공통,6,FALSE))","v":"B"}]
[{"$nulls":4},{"$f":"IF(VLOOKUP(C175,평가결과_공통,7,FALSE)=\"\",\"\",IF(메인!$J$7>=5,메인!$F$15,\"\"))","v":""},{"$f":"IF(VLOOKUP(C175,평가결과_공통,7,FALSE)=\"\",\"\",VLOOKUP(C175,평가결과_공통,7,FALSE))","v":""}]
[{"$nulls":4},{"$f":"IF(VLOOKUP(C175,평가결과_공통,8,FALSE)=\"\",\"\",IF(메인!$J$7>=6,메인!$F$16,\"\"))","v":""},{"$f":"IF(VLOOKUP(C175,평가결과_공통,8,FALSE)=\"\",\"\",VLOOKUP(C175,평가결과_공통,8,FALSE))","v":""}]
[{"$nulls":4},{"$f":"IF(VLOOKUP(C175,평가결과_공통,9,FALSE)=\"\",\"\",IF(메인!$J$7>=7,메인!$F$17,\"\"))","v":""},{"$f":"IF(VLOOKUP(C175,평가결과_공통,9,FALSE)=\"\",\"\",VLOOKUP(C175,평가결과_공통,9,FALSE))","v":""}]
[null,null,26,{"$f":"IF(VLOOKUP(C182,학적,2,FALSE)=\"\",\"\",VLOOKUP(C182,학적,2,FALSE))","v":""},{"$f":"IF(VLOOKUP(C182,평가결과_공통,3,FALSE)=\"\",\"\",IF(메인!$J$7>=1,메인!$F$11,\"\"))","v":""},{"$f":"IF(VLOOKUP(C182,평가결과_공통,3,FALSE)=\"\",\"\",VLOOKUP(C182,평가결과_공통,3,FALSE))","v":""},{"$f":"IF(OR(D182=\"\",COUNTBLANK(F182:F188)=7),\"\",VLOOKUP(D182,평가_교과!$D$7:$X$46,20,FALSE))","v":""},{"$nulls":3},{"$f":"IF(G182=\"\",\"\",LEN(G182))","v":""}]
[{"$nulls":4},{"$f":"IF(VLOOKUP(C182,평가결과_공통,4,FALSE)=\"\",\"\",IF(메인!$J$7>=2,메인!$F$12,\"\"))","v":""},{"$f":"IF(VLOOKUP(C182,평가결과_공통,4,FALSE)=\"\",\"\",VLOOKUP(C182,평가결과_공통,4,FALSE))","v":""}]
[{"$nulls":4},{"$f":"IF(VLOOKUP(C182,평가결과_공통,5,FALSE)=\"\",\"\",IF(메인!$J$7>=3,메인!$F$13,\"\"))","v":""},{"$f":"IF(VLOOKUP(C182,평가결과_공통,5,FALSE)=\"\",\"\",VLOOKUP(C182,평가결과_공통,5,FALSE))","v":""}]
[{"$nulls":4},{"$f":"IF(VLOOKUP(C182,평가결과_공통,6,FALSE)=\"\",\"\",IF(메인!$J$7>=4,메인!$F$14,\"\"))","v":""},{"$f":"IF(VLOOKUP(C182,평가결과_공통,6,FALSE)=\"\",\"\",VLOOKUP(C182,평가결과_공통,6,FALSE))","v":""}]
[{"$nulls":4},{"$f":"IF(VLOOKUP(C182,평가결과_공통,7,FALSE)=\"\",\"\",IF(메인!$J$7>=5,메인!$F$15,\"\"))","v":""},{"$f":"IF(VLOOKUP(C182,평가결과_공통,7,FALSE)=\"\",\"\",VLOOKUP(C182,평가결과_공통,7,FALSE))","v":""}]
[{"$nulls":4},{"$f":"IF(VLOOKUP(C182,평가결과_공통,8,FALSE)=\"\",\"\",IF(메인!$J$7>=6,메인!$F$16,\"\"))","v":""},{"$f":"IF(VLOOKUP(C182,평가결과_공통,8,FALSE)=\"\",\"\",VLOOKUP(C182,평가결과_공통,8,FALSE))","v":""}]
[{"$nulls":4},{"$f":"IF(VLOOKUP(C182,평가결과_공통,9,FALSE)=\"\",\"\",IF(메인!$J$7>=7,메인!$F$17,\"\"))","v":""},{"$f":"IF(VLOOKUP(C182,평가결과_공통,9,FALSE)=\"\",\"\",VLOOKUP(C182,평가결과_공통,9,FALSE))","v":""}]
[null,null,27,{"$f":"IF(VLOOKUP(C189,학적,2,FALSE)=\"\",\"\",VLOOKUP(C189,학적,2,FALSE))","v":""},{"$f":"IF(VLOOKUP(C189,평가결과_공통,3,FALSE)=\"\",\"\",IF(메인!$J$7>=1,메인!$F$11,\"\"))","v":""},{"$f":"IF(VLOOKUP(C189,평가결과_공통,3,FALSE)=\"\",\"\",VLOOKUP(C189,평가결과_공통,3,FALSE))","v":""},{"$f":"IF(OR(D189=\"\",COUNTBLANK(F189:F195)=7),\"\",VLOOKUP(D189,평가_교과!$D$7:$X$46,20,FALSE))","v":""},{"$nulls":3},{"$f":"IF(G189=\"\",\"\",LEN(G189))","v":""}]
[{"$nulls":4},{"$f":"IF(VLOOKUP(C189,평가결과_공통,4,FALSE)=\"\",\"\",IF(메인!$J$7>=2,메인!$F$12,\"\"))","v":""},{"$f":"IF(VLOOKUP(C189,평가결과_공통,4,FALSE)=\"\",\"\",VLOOKUP(C189,평가결과_공통,4,FALSE))","v":""}]
[{"$nulls":4},{"$f":"IF(VLOOKUP(C189,평가결과_공통,5,FALSE)=\"\",\"\",IF(메인!$J$7>=3,메인!$F$13,\"\"))","v":""},{"$f":"IF(VLOOKUP(C189,평가결과_공통,5,FALSE)=\"\",\"\",VLOOKUP(C189,평가결과_공통,5,FALSE))","v":""}]
[{"$nulls":4},{"$f":"IF(VLOOKUP(C189,평가결과_공통,6,FALSE)=\"\",\"\",IF(메인!$J$7>=4,메인!$F$14,\"\"))","v":""},{"$f":"IF(VLOOKUP(C189,평가결과_공통,6,FALSE)=\"\",\"\",VLOOKUP(C189,평가결과_공통,6,FALSE))","v":""}]
[{"$nulls":4},{"$f":"IF(VLOOKUP(C189,평가결과_공통,7,FALSE)=\"\",\"\",IF(메인!$J$7>=5,메인!$F$15,\"\"))","v":""},{"$f":"IF(VLOOKUP(C189,평가결과_공통,7,FALSE)=\"\",\"\",VLOOKUP(C189,평가결과_공통,7,FALSE))","v":""}]
[{"$nulls":4},{"$f":"IF(VLOOKUP(C189,평가결과_공통,8,FALSE)=\"\",\"\",IF(메인!$J$7>=6,메인!$F$16,\"\"))","v":""},{"$f":"IF(VLOOKUP(C189,평가결과_공통,8,FALSE)=\"\",\"\",VLOOKUP(C189,평가결과_공통,8,FALSE))","v":""}]
[{"$nulls":4},{"$f":"IF(VLOOKUP(C189,평가결과_공통,9,FALSE)=\"\",\"\",IF(메인!$J$7>=7,메인!$F$17,\"\"))","v":""},{"$f":"IF(VLOOKUP(C189,평가결과_공통,9,FALSE)=\"\",\"\",VLOOKUP(C189,평가결과_공통,9,FALSE))","v":""}]
[null,null,28,{"$f":"IF(VLOOKUP(C196,학적,2,FALSE)=\"\",\"\",VLOOKUP(C196,학적,2,FALSE))","v":""},{"$f":"IF(VLOOKUP(C196,평가결과_공통,3,FALSE)=\"\",\"\",IF(메인!$J$7>=1,메인!$F$11,\"\"))","v":""},{"$f":"IF(VLOOKUP(C196,평가결과_공통,3,FALSE)=\"\",\"\",VLOOKUP(C196,평가결과_공통,3,FALSE))","v":""},{"$f":"IF(OR(D196=\"\",COUNTBLANK(F196:F202)=7),\"\",VLOOKUP(D196,평가_교과!$D$7:$X$46,20,FALSE))","v":""},{"$nulls":3},{"$f":"IF(G196=\"\",\"\",LEN(G196))","v":""}]
[{"$nulls":4},{"$f":"IF(VLOOKUP(C196,평가결과_공통,4,FALSE)=\"\",\"\",IF(메인!$J$7>=2,메인!$F$12,\"\"))","v":""},{"$f":"IF(VLOOKUP(C196,평가결과_공통,4,FALSE)=\"\",\"\",VLOOKUP(C196,평가결과_공통,4,FALSE))","v":""}]
[{"$nulls":4},{"$f":"IF(VLOOKUP(C196,평가결과_공통,5,FALSE)=\"\",\"\",IF(메인!$J$7>=3,메인!$F$13,\"\"))","v":""},{"$f":"IF(VLOOKUP(C196,평가결과_공통,5,FALSE)=\"\",\"\",VLOOKUP(C196,평가결과_공통,5,FALSE))","v":""}]
[{"$nulls":4},{"$f":"IF(VLOOKUP(C196,평가결과_공통,6,FALSE)=\"\",\"\",IF(메인!$J$7>=4,메인!$F$14,\"\"))","v":""},{"$f":"IF(VLOOKUP(C196,평가결과_공통,6,FALSE)=\"\",\"\",VLOOKUP(C196,평가결과_공통,6,FALSE))","v":""}]
[{"$nulls":4},{"$f":"IF(VLOOKUP(C196,평가결과_공통,7,FALSE)=\"\",\"\",IF(메인!$J$7>=5,메인!$F$15,\"\"))","v":""},{"$f":"IF(VLOOKUP(C196,평가결과_공통,7,FALSE)=\"\",\"\",VLOOKUP(C196,평가결과_공통,7,FALSE))","v":""}]
[{"$nulls":4},{"$f":"IF(VLOOKUP(C196,평가결과_공통,8,FALSE)=\"\",\"\",IF(메인!$J$7>=6,메인!$F$16,\"\"))","v":""},{"$f":"IF(VLOOKUP(C196,평가결과_공통,8,FALSE)=\"\",\"\",VLOOKUP(C196,평가결과_공통,8,FALSE))","v":""}]
[{"$nulls":4},{"$f":"IF(VLOOKUP(C196,평가결과_공통,9,FALSE)=\"\",\"\",IF(메인!$J$7>=7,메인!$F$17,\"\"))","v":""},{"$f":"IF(VLOOKUP(C196,평가결과_공통,9,FALSE)=\"\",\"\",VLOOKUP(C196,평가결과_공통,9,FALSE))","v":""}]
[null,null,29,{"$f":"IF(VLOOKUP(C203,학적,2,FALSE)=\"\",\"\",VLOOKUP(C203,학적,2,FALSE))","v":""},{"$f":"IF(VLOOKUP(C203,평가결과_공통,3,FALSE)=\"\",\"\",IF(메인!$J$7>=1,메인!$F$11,\"\"))","v":""},{"$f":"IF(VLOOKUP(C203,평가결과_공통,3,FALSE)=\"\",\"\",VLOOKUP(C203,평가결과_공통,3,FALSE))","v":""},{"$f":"IF(OR(D203=\"\",COUNTBLANK(F203:F209)=7),\"\",VLOOKUP(D203,평가_교과!$D$7:$X$46,20,FALSE))","v":""},{"$nulls":3},{"$f":"IF(G203=\"\",\"\",LEN(G203))","v":""}]
[{"$nulls":4},{"$f":"IF(VLOOKUP(C203,평가결과_공통,4,FALSE)=\"\",\"\",IF(메인!$J$7>=2,메인!$F$12,\"\"))","v":""},{"$f":"IF(VLOOKUP(C203,평가결과_공통,4,FALSE)=\"\",\"\",VLOOKUP(C203,평가결과_공통,4,FALSE))","v":""}]
[{"$nulls":4},{"$f":"IF(VLOOKUP(C203,평가결과_공통,5,FALSE)=\"\",\"\",IF(메인!$J$7>=3,메인!$F$13,\"\"))","v":""},{"$f":"IF(VLOOKUP(C203,평가결과_공통,5,FALSE)=\"\",\"\",VLOOKUP(C203,평가결과_공통,5,FALSE))","v":""}]
[{"$nulls":4},{"$f":"IF(VLOOKUP(C203,평가결과_공통,6,FALSE)=\"\",\"\",IF(메인!$J$7>=4,메인!$F$14,\"\"))","v":""},{"$f":"IF(VLOOKUP(C203,평가결과_공통,6,FALSE)=\"\",\"\",VLOOKUP(C203,평가결과_공통,6,FALSE))","v":""}]
[{"$nulls":4},{"$f":"IF(VLOOKUP(C203,평가결과_공통,7,FALSE)=\"\",\"\",IF(메인!$J$7>=5,메인!$F$15,\"\"))","v":""},{"$f":"IF(VLOOKUP(C203,평가결과_공통,7,FALSE)=\"\",\"\",VLOOKUP(C203,평가결과_공통,7,FALSE))","v":""}]
[{"$nulls":4},{"$f":"IF(VLOOKUP(C203,평가결과_공통,8,FALSE)=\"\",\"\",IF(메인!$J$7>=6,메인!$F$16,\"\"))","v":""},{"$f":"IF(VLOOKUP(C203,평가결과_공통,8,FALSE)=\"\",\"\",VLOOKUP(C203,평가결과_공통,8,FALSE))","v":""}]
[{"$nulls":4},{"$f":"IF(VLOOKUP(C203,평가결과_공통,9,FALSE)=\"\",\"\",IF(메인!$J$7>=7,메인!$F$17,\"\"))","v":""},{"$f":"IF(VLOOKUP(C203,평가결과_공통,9,FALSE)=\"\",\"\",VLOOKUP(C203,평가결과_공통,9,FALSE))","v":""}]
[null,null,30,{"$f":"IF(VLOOKUP(C210,학적,2,FALSE)=\"\",\"\",VLOOKUP(C210,학적,2,FALSE))","v":""},{"$f":"IF(VLOOKUP(C210,평가결과_공통,3,FALSE)=\"\",\"\",IF(메인!$J$7>=1,메인!$F$11,\"\"))","v":""},{"$f":"IF(VLOOKUP(C210,평가결과_공통,3,FALSE)=\"\",\"\",VLOOKUP(C210,평가결과_공통,3,FALSE))","v":""},{"$f":"IF(OR(D210=\"\",COUNTBLANK(F210:F216)=7),\"\",VLOOKUP(D210,평가_교과!$D$7:$X$46,20,FALSE))","v":""},{"$nulls":3},{"$f":"IF(G210=\"\",\"\",LEN(G210))","v":""}]
[{"$nulls":4},{"$f":"IF(VLOOKUP(C210,평가결과_공통,4,FALSE)=\"\",\"\",IF(메인!$J$7>=2,메인!$F$12,\"\"))","v":""},{"$f":"IF(VLOOKUP(C210,평가결과_공통,4,FALSE)=\"\",\"\",VLOOKUP(C210,평가결과_공통,4,FALSE))","v":""}]
[{"$nulls":4},{"$f":"IF(VLOOKUP(C210,평가결과_공통,5,FALSE)=\"\",\"\",IF(메인!$J$7>=3,메인!$F$13,\"\"))","v":""},{"$f":"IF(VLOOKUP(C210,평가결과_공통,5,FALSE)=\"\",\"\",VLOOKUP(C210,평가결과_공통,5,FALSE))","v":""}]
[{"$nulls":4},{"$f":"IF(VLOOKUP(C210,평가결과_공통,6,FALSE)=\"\",\"\",IF(메인!$J$7>=4,메인!$F$14,\"\"))","v":""},{"$f":"IF(VLOOKUP(C210,평가결과_공통,6,FALSE)=\"\",\"\",VLOOKUP(C210,평가결과_공통,6,FALSE))","v":""}]
[{"$nulls":4},{"$f":"IF(VLOOKUP(C210,평가결과_공통,7,FALSE)=\"\",\"\",IF(메인!$J$7>=5,메인!$F$15,\"\"))","v":""},{"$f":"IF(VLOOKUP(C210,평가결과_공통,7,FALSE)=\"\",\"\",VLOOKUP(C210,평가결과_공통,7,FALSE))","v":""}]
[{"$nulls":4},{"$f":"IF(VLOOKUP(C210,평가결과_공통,8,FALSE)=\"\",\"\",IF(메인!$J$7>=6,메인!$F$16,\"\"))","v":""},{"$f":"IF(VLOOKUP(C210,평가결과_공통,8,FALSE)=\"\",\"\",VLOOKUP(C210,평가결과_공통,8,FALSE))","v":""}]
[{"$nulls":4},{"$f":"IF(VLOOKUP(C210,평가결과_공통,9,FALSE)=\"\",\"\",IF(메인!$J$7>=7,메인!$F$17,\"\"))","v":""},{"$f":"IF(VLOOKUP(C210,평가결과_공통,9,FALSE)=\"\",\"\",VLOOKUP(C210,평가결과_공통,9,FALSE))","v":""}]
[null,null,31,{"$f":"IF(VLOOKUP(C217,학적,2,FALSE)=\"\",\"\",VLOOKUP(C217,학적,2,FALSE))","v":""},{"$f":"IF(VLOOKUP(C217,평가결과_공통,3,FALSE)=\"\",\"\",IF(메인!$J$7>=1,메인!$F$11,\"\"))","v":""},{"$f":"IF(VLOOKUP(C217,평가결과_공통,3,FALSE)=\"\",\"\",VLOOKUP(C217,평가결과_공통,3,FALSE))","v":""},{"$f":"IF(OR(D217=\"\",COUNTBLANK(F217:F223)=7),\"\",VLOOKUP(D217,평가_교과!$D$7:$X$46,20,FALSE))","v":""},{"$nulls":3},{"$f":"IF(G217=\"\",\"\",LEN(G217))","v":""}]
[{"$nulls":4},{"$f":"IF(VLOOKUP(C217,평가결과_공통,4,FALSE)=\"\",\"\",IF(메인!$J$7>=2,메인!$F$12,\"\"))","v":""},{"$f":"IF(VLOOKUP(C217,평가결과_공통,4,FALSE)=\"\",\"\",VLOOKUP(C217,평가결과_공통,4,FALSE))","v":""}]
[{"$nulls":4},{"$f":"IF(VLOOKUP(C217,평가결과_공통,5,FALSE)=\"\",\"\",IF(메인!$J$7>=3,메인!$F$13,\"\"))","v":""},{"$f":"IF(VLOOKUP(C217,평가결과_공통,5,FALSE)=\"\",\"\",VLOOKUP(C217,평가결과_공통,5,FALSE))","v":""}]
[{"$nulls":4},{"$f":"IF(VLOOKUP(C217,평가결과_공통,6,FALSE)=\"\",\"\",IF(메인!$J$7>=4,메인!$F$14,\"\"))","v":""},{"$f":"IF(VLOOKUP(C217,평가결과_공통,6,FALSE)=\"\",\"\",VLOOKUP(C217,평가결과_공통,6,FALSE))","v":""}]
[{"$nulls":4},{"$f":"IF(VLOOKUP(C217,평가결과_공통,7,FALSE)=\"\",\"\",IF(메인!$J$7>=5,메인!$F$15,\"\"))","v":""},{"$f":"IF(VLOOKUP(C217,평가결과_공통,7,FALSE)=\"\",\"\",VLOOKUP(C217,평가결과_공통,7,FALSE))","v":""}]
[{"$nulls":4},{"$f":"IF(VLOOKUP(C217,평가결과_공통,8,FALSE)=\"\",\"\",IF(메인!$J$7>=6,메인!$F$16,\"\"))","v":""},{"$f":"IF(VLOOKUP(C217,평가결과_공통,8,FALSE)=\"\",\"\",VLOOKUP(C217,평가결과_공통,8,FALSE))","v":""}]
[{"$nulls":4},{"$f":"IF(VLOOKUP(C217,평가결과_공통,9,FALSE)=\"\",\"\",IF(메인!$J$7>=7,메인!$F$17,\"\"))","v":""},{"$f":"IF(VLOOKUP(C217,평가결과_공통,9,FALSE)=\"\",\"\",VLOOKUP(C217,평가결과_공통,9,FALSE))","v":""}]
[null,null,32,{"$f":"IF(VLOOKUP(C224,학적,2,FALSE)=\"\",\"\",VLOOKUP(C224,학적,2,FALSE))","v":""},{"$f":"IF(VLOOKUP(C224,평가결과_공통,3,FALSE)=\"\",\"\",IF(메인!$J$7>=1,메인!$F$11,\"\"))","v":""},{"$f":"IF(VLOOKUP(C224,평가결과_공통,3,FALSE)=\"\",\"\",VLOOKUP(C224,평가결과_공통,3,FALSE))","v":""},{"$f":"IF(OR(D224=\"\",COUNTBLANK(F224:F230)=7),\"\",VLOOKUP(D224,평가_교과!$D$7:$X$46,20,FALSE))","v":""},{"$nulls":3},{"$f":"IF(G224=\"\",\"\",LEN(G224))","v":""}]
[{"$nulls":4},{"$f":"IF(VLOOKUP(C224,평가결과_공통,4,FALSE)=\"\",\"\",IF(메인!$J$7>=2,메인!$F$12,\"\"))","v":""},{"$f":"IF(VLOOKUP(C224,평가결과_공통,4,FALSE)=\"\",\"\",VLOOKUP(C224,평가결과_공통,4,FALSE))","v":""}]
[{"$nulls":4},{"$f":"IF(VLOOKUP(C224,평가결과_공통,5,FALSE)=\"\",\"\",IF(메인!$J$7>=3,메인!$F$13,\"\"))","v":""},{"$f":"IF(VLOOKUP(C224,평가결과_공통,5,FALSE)=\"\",\"\",VLOOKUP(C224,평가결과_공통,5,FALSE))","v":""}]
[{"$nulls":4},{"$f":"IF(VLOOKUP(C224,평가결과_공통,6,FALSE)=\"\",\"\",IF(메인!$J$7>=4,메인!$F$14,\"\"))","v":""},{"$f":"IF(VLOOKUP(C224,평가결과_공통,6,FALSE)=\"\",\"\",VLOOKUP(C224,평가결과_공통,6,FALSE))","v":""}]
[{"$nulls":4},{"$f":"IF(VLOOKUP(C224,평가결과_공통,7,FALSE)=\"\",\"\",IF(메인!$J$7>=5,메인!$F$15,\"\"))","v":""},{"$f":"IF(VLOOKUP(C224,평가결과_공통,7,FALSE)=\"\",\"\",VLOOKUP(C224,평가결과_공통,7,FALSE))","v":""}]
[{"$nulls":4},{"$f":"IF(VLOOKUP(C224,평가결과_공통,8,FALSE)=\"\",\"\",IF(메인!$J$7>=6,메인!$F$16,\"\"))","v":""},{"$f":"IF(VLOOKUP(C224,평가결과_공통,8,FALSE)=\"\",\"\",VLOOKUP(C224,평가결과_공통,8,FALSE))","v":""}]
[{"$nulls":4},{"$f":"IF(VLOOKUP(C224,평가결과_공통,9,FALSE)=\"\",\"\",IF(메인!$J$7>=7,메인!$F$17,\"\"))","v":""},{"$f":"IF(VLOOKUP(C224,평가결과_공통,9,FALSE)=\"\",\"\",VLOOKUP(C224,평가결과_공통,9,FALSE))","v":""}]
[null,null,33,{"$f":"IF(VLOOKUP(C231,학적,2,FALSE)=\"\",\"\",VLOOKUP(C231,학적,2,FALSE))","v":""},{"$f":"IF(VLOOKUP(C231,평가결과_공통,3,FALSE)=\"\",\"\",IF(메인!$J$7>=1,메인!$F$11,\"\"))","v":""},{"$f":"IF(VLOOKUP(C231,평가결과_공통,3,FALSE)=\"\",\"\",VLOOKUP(C231,평가결과_공통,3,FALSE))","v":""},{"$f":"IF(OR(D231=\"\",COUNTBLANK(F231:F237)=7),\"\",VLOOKUP(D231,평가_교과!$D$7:$X$46,20,FALSE))","v":""},{"$nulls":3},{"$f":"IF(G231=\"\",\"\",LEN(G231))","v":""}]
[{"$nulls":4},{"$f":"IF(VLOOKUP(C231,평가결과_공통,4,FALSE)=\"\",\"\",IF(메인!$J$7>=2,메인!$F$12,\"\"))","v":""},{"$f":"IF(VLOOKUP(C231,평가결과_공통,4,FALSE)=\"\",\"\",VLOOKUP(C231,평가결과_공통,4,FALSE))","v":""}]
[{"$nulls":4},{"$f":"IF(VLOOKUP(C231,평가결과_공통,5,FALSE)=\"\",\"\",IF(메인!$J$7>=3,메인!$F$13,\"\"))","v":""},{"$f":"IF(VLOOKUP(C231,평가결과_공통,5,FALSE)=\"\",\"\",VLOOKUP(C231,평가결과_공통,5,FALSE))","v":""}]
[{"$nulls":4},{"$f":"IF(VLOOKUP(C231,평가결과_공통,6,FALSE)=\"\",\"\",IF(메인!$J$7>=4,메인!$F$14,\"\"))","v":""},{"$f":"IF(VLOOKUP(C231,평가결과_공통,6,FALSE)=\"\",\"\",VLOOKUP(C231,평가결과_공통,6,FALSE))","v":""}]
[{"$nulls":4},{"$f":"IF(VLOOKUP(C231,평가결과_공통,7,FALSE)=\"\",\"\",IF(메인!$J$7>=5,메인!$F$15,\"\"))","v":""},{"$f":"IF(VLOOKUP(C231,평가결과_공통,7,FALSE)=\"\",\"\",VLOOKUP(C231,평가결과_공통,7,FALSE))","v":""}]
[{"$nulls":4},{"$f":"IF(VLOOKUP(C231,평가결과_공통,8,FALSE)=\"\",\"\",IF(메인!$J$7>=6,메인!$F$16,\"\"))","v":""},{"$f":"IF(VLOOKUP(C231,평가결과_공통,8,FALSE)=\"\",\"\",VLOOKUP(C231,평가결과_공통,8,FALSE))","v":""}]
[{"$nulls":4},{"$f":"IF(VLOOKUP(C231,평가결과_공통,9,FALSE)=\"\",\"\",IF(메인!$J$7>=7,메인!$F$17,\"\"))","v":""},{"$f":"IF(VLOOKUP(C231,평가결과_공통,9,FALSE)=\"\",\"\",VLOOKUP(C231,평가결과_공통,9,FALSE))","v":""}]
[null,null,34,{"$f":"IF(VLOOKUP(C238,학적,2,FALSE)=\"\",\"\",VLOOKUP(C238,학적,2,FALSE))","v":""},{"$f":"IF(VLOOKUP(C238,평가결과_공통,3,FALSE)=\"\",\"\",IF(메인!$J$7>=1,메인!$F$11,\"\"))","v":""},{"$f":"IF(VLOOKUP(C238,평가결과_공통,3,FALSE)=\"\",\"\",VLOOKUP(C238,평가결과_공통,3,FALSE))","v":""},{"$f":"IF(OR(D238=\"\",COUNTBLANK(F238:F244)=7),\"\",VLOOKUP(D238,평가_교과!$D$7:$X$46,20,FALSE))","v":""},{"$nulls":3},{"$f":"IF(G238=\"\",\"\",LEN(G238))","v":""}]
[{"$nulls":4},{"$f":"IF(VLOOKUP(C238,평가결과_공통,4,FALSE)=\"\",\"\",IF(메인!$J$7>=2,메인!$F$12,\"\"))","v":""},{"$f":"IF(VLOOKUP(C238,평가결과_공통,4,FALSE)=\"\",\"\",VLOOKUP(C238,평가결과_공통,4,FALSE))","v":""}]
[{"$nulls":4},{"$f":"IF(VLOOKUP(C238,평가결과_공통,5,FALSE)=\"\",\"\",IF(메인!$J$7>=3,메인!$F$13,\"\"))","v":""},{"$f":"IF(VLOOKUP(C238,평가결과_공통,5,FALSE)=\"\",\"\",VLOOKUP(C238,평가결과_공통,5,FALSE))","v":""}]
[{"$nulls":4},{"$f":"IF(VLOOKUP(C238,평가결과_공통,6,FALSE)=\"\",\"\",IF(메인!$J$7>=4,메인!$F$14,\"\"))","v":""},{"$f":"IF(VLOOKUP(C238,평가결과_공통,6,FALSE)=\"\",\"\",VLOOKUP(C238,평가결과_공통,6,FALSE))","v":""}]
[{"$nulls":4},{"$f":"IF(VLOOKUP(C238,평가결과_공통,7,FALSE)=\"\",\"\",IF(메인!$J$7>=5,메인!$F$15,\"\"))","v":""},{"$f":"IF(VLOOKUP(C238,평가결과_공통,7,FALSE)=\"\",\"\",VLOOKUP(C238,평가결과_공통,7,FALSE))","v":""}]
[{"$nulls":4},{"$f":"IF(VLOOKUP(C238,평가결과_공통,8,FALSE)=\"\",\"\",IF(메인!$J$7>=6,메인!$F$16,\"\"))","v":""},{"$f":"IF(VLOOKUP(C238,평가결과_공통,8,FALSE)=\"\",\"\",VLOOKUP(C238,평가결과_공통,8,FALSE))","v":""}]
[{"$nulls":4},{"$f":"IF(VLOOKUP(C238,평가결과_공통,9,FALSE)=\"\",\"\",IF(메인!$J$7>=7,메인!$F$17,\"\"))","v":""},{"$f":"IF(VLOOKUP(C238,평가결과_공통,9,FALSE)=\"\",\"\",VLOOKUP(C238,평가결과_공통,9,FALSE))","v":""}]
[null,null,35,{"$f":"IF(VLOOKUP(C245,학적,2,FALSE)=\"\",\"\",VLOOKUP(C245,학적,2,FALSE))","v":""},{"$f":"IF(VLOOKUP(C245,평가결과_공통,3,FALSE)=\"\",\"\",IF(메인!$J$7>=1,메인!$F$11,\"\"))","v":""},{"$f":"IF(VLOOKUP(C245,평가결과_공통,3,FALSE)=\"\",\"\",VLOOKUP(C245,평가결과_공통,3,FALSE))","v":""},{"$f":"IF(OR(D245=\"\",COUNTBLANK(F245:F251)=7),\"\",VLOOKUP(D245,평가_교과!$D$7:$X$46,20,FALSE))","v":""},{"$nulls":3},{"$f":"IF(G245=\"\",\"\",LEN(G245))","v":""}]
[{"$nulls":4},{"$f":"IF(VLOOKUP(C245,평가결과_공통,4,FALSE)=\"\",\"\",IF(메인!$J$7>=2,메인!$F$12,\"\"))","v":""},{"$f":"IF(VLOOKUP(C245,평가결과_공통,4,FALSE)=\"\",\"\",VLOOKUP(C245,평가결과_공통,4,FALSE))","v":""}]
[{"$nulls":4},{"$f":"IF(VLOOKUP(C245,평가결과_공통,5,FALSE)=\"\",\"\",IF(메인!$J$7>=3,메인!$F$13,\"\"))","v":""},{"$f":"IF(VLOOKUP(C245,평가결과_공통,5,FALSE)=\"\",\"\",VLOOKUP(C245,평가결과_공통,5,FALSE))","v":""}]
[{"$nulls":4},{"$f":"IF(VLOOKUP(C245,평가결과_공통,6,FALSE)=\"\",\"\",IF(메인!$J$7>=4,메인!$F$14,\"\"))","v":""},{"$f":"IF(VLOOKUP(C245,평가결과_공통,6,FALSE)=\"\",\"\",VLOOKUP(C245,평가결과_공통,6,FALSE))","v":""}]
[{"$nulls":4},{"$f":"IF(VLOOKUP(C245,평가결과_공통,7,FALSE)=\"\",\"\",IF(메인!$J$7>=5,메인!$F$15,\"\"))","v":""},{"$f":"IF(VLOOKUP(C245,평가결과_공통,7,FALSE)=\"\",\"\",VLOOKUP(C245,평가결과_공통,7,FALSE))","v":""}]
[{"$nulls":4},{"$f":"IF(VLOOKUP(C245,평가결과_공통,8,FALSE)=\"\",\"\",IF(메인!$J$7>=6,메인!$F$16,\"\"))","v":""},{"$f":"IF(VLOOKUP(C245,평가결과_공통,8,FALSE)=\"\",\"\",VLOOKUP(C245,평가결과_공통,8,FALSE))","v":""}]
[{"$nulls":4},{"$f":"IF(VLOOKUP(C245,평가결과_공통,9,FALSE)=\"\",\"\",IF(메인!$J$7>=7,메인!$F$17,\"\"))","v":""},{"$f":"IF(VLOOKUP(C245,평가결과_공통,9,FALSE)=\"\",\"\",VLOOKUP(C245,평가결과_공통,9,FALSE))","v":""}]
[null,null,36,{"$f":"IF(VLOOKUP(C252,학적,2,FALSE)=\"\",\"\",VLOOKUP(C252,학적,2,FALSE))","v":""},{"$f":"IF(VLOOKUP(C252,평가결과_공통,3,FALSE)=\"\",\"\",IF(메인!$J$7>=1,메인!$F$11,\"\"))","v":""},{"$f":"IF(VLOOKUP(C252,평가결과_공통,3,FALSE)=\"\",\"\",VLOOKUP(C252,평가결과_공통,3,FALSE))","v":""},{"$f":"IF(OR(D252=\"\",COUNTBLANK(F252:F258)=7),\"\",VLOOKUP(D252,평가_교과!$D$7:$X$46,20,FALSE))","v":""},{"$nulls":3},{"$f":"IF(G252=\"\",\"\",LEN(G252))","v":""}]
[{"$nulls":4},{"$f":"IF(VLOOKUP(C252,평가결과_공통,4,FALSE)=\"\",\"\",IF(메인!$J$7>=2,메인!$F$12,\"\"))","v":""},{"$f":"IF(VLOOKUP(C252,평가결과_공통,4,FALSE)=\"\",\"\",VLOOKUP(C252,평가결과_공통,4,FALSE))","v":""}]
[{"$nulls":4},{"$f":"IF(VLOOKUP(C252,평가결과_공통,5,FALSE)=\"\",\"\",IF(메인!$J$7>=3,메인!$F$13,\"\"))","v":""},{"$f":"IF(VLOOKUP(C252,평가결과_공통,5,FALSE)=\"\",\"\",VLOOKUP(C252,평가결과_공통,5,FALSE))","v":""}]
[{"$nulls":4},{"$f":"IF(VLOOKUP(C252,평가결과_공통,6,FALSE)=\"\",\"\",IF(메인!$J$7>=4,메인!$F$14,\"\"))","v":""},{"$f":"IF(VLOOKUP(C252,평가결과_공통,6,FALSE)=\"\",\"\",VLOOKUP(C252,평가결과_공통,6,FALSE))","v":""}]
[{"$nulls":4},{"$f":"IF(VLOOKUP(C252,평가결과_공통,7,FALSE)=\"\",\"\",IF(메인!$J$7>=5,메인!$F$15,\"\"))","v":""},{"$f":"IF(VLOOKUP(C252,평가결과_공통,7,FALSE)=\"\",\"\",VLOOKUP(C252,평가결과_공통,7,FALSE))","v":""}]
[{"$nulls":4},{"$f":"IF(VLOOKUP(C252,평가결과_공통,8,FALSE)=\"\",\"\",IF(메인!$J$7>=6,메인!$F$16,\"\"))","v":""},{"$f":"IF(VLOOKUP(C252,평가결과_공통,8,FALSE)=\"\",\"\",VLOOKUP(C252,평가결과_공통,8,FALSE))","v":""}]
[{"$nulls":4},{"$f":"IF(VLOOKUP(C252,평가결과_공통,9,FALSE)=\"\",\"\",IF(메인!$J$7>=7,메인!$F$17,\"\"))","v":""},{"$f":"IF(VLOOKUP(C252,평가결과_공통,9,FALSE)=\"\",\"\",VLOOKUP(C252,평가결과_공통,9,FALSE))","v":""}]
[null,null,37,{"$f":"IF(VLOOKUP(C259,학적,2,FALSE)=\"\",\"\",VLOOKUP(C259,학적,2,FALSE))","v":""},{"$f":"IF(VLOOKUP(C259,평가결과_공통,3,FALSE)=\"\",\"\",IF(메인!$J$7>=1,메인!$F$11,\"\"))","v":""},{"$f":"IF(VLOOKUP(C259,평가결과_공통,3,FALSE)=\"\",\"\",VLOOKUP(C259,평가결과_공통,3,FALSE))","v":""},{"$f":"IF(OR(D259=\"\",COUNTBLANK(F259:F265)=7),\"\",VLOOKUP(D259,평가_교과!$D$7:$X$46,20,FALSE))","v":""},{"$nulls":3},{"$f":"IF(G259=\"\",\"\",LEN(G259))","v":""}]
[{"$nulls":4},{"$f":"IF(VLOOKUP(C259,평가결과_공통,4,FALSE)=\"\",\"\",IF(메인!$J$7>=2,메인!$F$12,\"\"))","v":""},{"$f":"IF(VLOOKUP(C259,평가결과_공통,4,FALSE)=\"\",\"\",VLOOKUP(C259,평가결과_공통,4,FALSE))","v":""}]
[{"$nulls":4},{"$f":"IF(VLOOKUP(C259,평가결과_공통,5,FALSE)=\"\",\"\",IF(메인!$J$7>=3,메인!$F$13,\"\"))","v":""},{"$f":"IF(VLOOKUP(C259,평가결과_공통,5,FALSE)=\"\",\"\",VLOOKUP(C259,평가결과_공통,5,FALSE))","v":""}]
[{"$nulls":4},{"$f":"IF(VLOOKUP(C259,평가결과_공통,6,FALSE)=\"\",\"\",IF(메인!$J$7>=4,메인!$F$14,\"\"))","v":""},{"$f":"IF(VLOOKUP(C259,평가결과_공통,6,FALSE)=\"\",\"\",VLOOKUP(C259,평가결과_공통,6,FALSE))","v":""}]
[{"$nulls":4},{"$f":"IF(VLOOKUP(C259,평가결과_공통,7,FALSE)=\"\",\"\",IF(메인!$J$7>=5,메인!$F$15,\"\"))","v":""},{"$f":"IF(VLOOKUP(C259,평가결과_공통,7,FALSE)=\"\",\"\",VLOOKUP(C259,평가결과_공통,7,FALSE))","v":""}]
[{"$nulls":4},{"$f":"IF(VLOOKUP(C259,평가결과_공통,8,FALSE)=\"\",\"\",IF(메인!$J$7>=6,메인!$F$16,\"\"))","v":""},{"$f":"IF(VLOOKUP(C259,평가결과_공통,8,FALSE)=\"\",\"\",VLOOKUP(C259,평가결과_공통,8,FALSE))","v":""}]
[{"$nulls":4},{"$f":"IF(VLOOKUP(C259,평가결과_공통,9,FALSE)=\"\",\"\",IF(메인!$J$7>=7,메인!$F$17,\"\"))","v":""},{"$f":"IF(VLOOKUP(C259,평가결과_공통,9,FALSE)=\"\",\"\",VLOOKUP(C259,평가결과_공통,9,FALSE))","v":""}]
[null,null,38,{"$f":"IF(VLOOKUP(C266,학적,2,FALSE)=\"\",\"\",VLOOKUP(C266,학적,2,FALSE))","v":""},{"$f":"IF(VLOOKUP(C266,평가결과_공통,3,FALSE)=\"\",\"\",IF(메인!$J$7>=1,메인!$F$11,\"\"))","v":""},{"$f":"IF(VLOOKUP(C266,평가결과_공통,3,FALSE)=\"\",\"\",VLOOKUP(C266,평가결과_공통,3,FALSE))","v":""},{"$f":"IF(OR(D266=\"\",COUNTBLANK(F266:F272)=7),\"\",VLOOKUP(D266,평가_교과!$D$7:$X$46,20,FALSE))","v":""},{"$nulls":3},{"$f":"IF(G266=\"\",\"\",LEN(G266))","v":""}]
[{"$nulls":4},{"$f":"IF(VLOOKUP(C266,평가결과_공통,4,FALSE)=\"\",\"\",IF(메인!$J$7>=2,메인!$F$12,\"\"))","v":""},{"$f":"IF(VLOOKUP(C266,평가결과_공통,4,FALSE)=\"\",\"\",VLOOKUP(C266,평가결과_공통,4,FALSE))","v":""}]
[{"$nulls":4},{"$f":"IF(VLOOKUP(C266,평가결과_공통,5,FALSE)=\"\",\"\",IF(메인!$J$7>=3,메인!$F$13,\"\"))","v":""},{"$f":"IF(VLOOKUP(C266,평가결과_공통,5,FALSE)=\"\",\"\",VLOOKUP(C266,평가결과_공통,5,FALSE))","v":""}]
[{"$nulls":4},{"$f":"IF(VLOOKUP(C266,평가결과_공통,6,FALSE)=\"\",\"\",IF(메인!$J$7>=4,메인!$F$14,\"\"))","v":""},{"$f":"IF(VLOOKUP(C266,평가결과_공통,6,FALSE)=\"\",\"\",VLOOKUP(C266,평가결과_공통,6,FALSE))","v":""}]
[{"$nulls":4},{"$f":"IF(VLOOKUP(C266,평가결과_공통,7,FALSE)=\"\",\"\",IF(메인!$J$7>=5,메인!$F$15,\"\"))","v":""},{"$f":"IF(VLOOKUP(C266,평가결과_공통,7,FALSE)=\"\",\"\",VLOOKUP(C266,평가결과_공통,7,FALSE))","v":""}]
[{"$nulls":4},{"$f":"IF(VLOOKUP(C266,평가결과_공통,8,FALSE)=\"\",\"\",IF(메인!$J$7>=6,메인!$F$16,\"\"))","v":""},{"$f":"IF(VLOOKUP(C266,평가결과_공통,8,FALSE)=\"\",\"\",VLOOKUP(C266,평가결과_공통,8,FALSE))","v":""}]
[{"$nulls":4},{"$f":"IF(VLOOKUP(C266,평가결과_공통,9,FALSE)=\"\",\"\",IF(메인!$J$7>=7,메인!$F$17,\"\"))","v":""},{"$f":"IF(VLOOKUP(C266,평가결과_공통,9,FALSE)=\"\",\"\",VLOOKUP(C266,평가결과_공통,9,FALSE))","v":""}]
[null,null,39,{"$f":"IF(VLOOKUP(C273,학적,2,FALSE)=\"\",\"\",VLOOKUP(C273,학적,2,FALSE))","v":""},{"$f":"IF(VLOOKUP(C273,평가결과_공통,3,FALSE)=\"\",\"\",IF(메인!$J$7>=1,메인!$F$11,\"\"))","v":""},{"$f":"IF(VLOOKUP(C273,평가결과_공통,3,FALSE)=\"\",\"\",VLOOKUP(C273,평가결과_공통,3,FALSE))","v":""},{"$f":"IF(OR(D273=\"\",COUNTBLANK(F273:F279)=7),\"\",VLOOKUP(D273,평가_교과!$D$7:$X$46,20,FALSE))","v":""},{"$nulls":3},{"$f":"IF(G273=\"\",\"\",LEN(G273))","v":""}]
[{"$nulls":4},{"$f":"IF(VLOOKUP(C273,평가결과_공통,4,FALSE)=\"\",\"\",IF(메인!$J$7>=2,메인!$F$12,\"\"))","v":""},{"$f":"IF(VLOOKUP(C273,평가결과_공통,4,FALSE)=\"\",\"\",VLOOKUP(C273,평가결과_공통,4,FALSE))","v":""}]
[{"$nulls":4},{"$f":"IF(VLOOKUP(C273,평가결과_공통,5,FALSE)=\"\",\"\",IF(메인!$J$7>=3,메인!$F$13,\"\"))","v":""},{"$f":"IF(VLOOKUP(C273,평가결과_공통,5,FALSE)=\"\",\"\",VLOOKUP(C273,평가결과_공통,5,FALSE))","v":""}]
[{"$nulls":4},{"$f":"IF(VLOOKUP(C273,평가결과_공통,6,FALSE)=\"\",\"\",IF(메인!$J$7>=4,메인!$F$14,\"\"))","v":""},{"$f":"IF(VLOOKUP(C273,평가결과_공통,6,FALSE)=\"\",\"\",VLOOKUP(C273,평가결과_공통,6,FALSE))","v":""}]
[{"$nulls":4},{"$f":"IF(VLOOKUP(C273,평가결과_공통,7,FALSE)=\"\",\"\",IF(메인!$J$7>=5,메인!$F$15,\"\"))","v":""},{"$f":"IF(VLOOKUP(C273,평가결과_공통,7,FALSE)=\"\",\"\",VLOOKUP(C273,평가결과_공통,7,FALSE))","v":""}]
[{"$nulls":4},{"$f":"IF(VLOOKUP(C273,평가결과_공통,8,FALSE)=\"\",\"\",IF(메인!$J$7>=6,메인!$F$16,\"\"))","v":""},{"$f":"IF(VLOOKUP(C273,평가결과_공통,8,FALSE)=\"\",\"\",VLOOKUP(C273,평가결과_공통,8,FALSE))","v":""}]
[{"$nulls":4},{"$f":"IF(VLOOKUP(C273,평가결과_공통,9,FALSE)=\"\",\"\",IF(메인!$J$7>=7,메인!$F$17,\"\"))","v":""},{"$f":"IF(VLOOKUP(C273,평가결과_공통,9,FALSE)=\"\",\"\",VLOOKUP(C273,평가결과_공통,9,FALSE))","v":""}]
[null,null,40,{"$f":"IF(VLOOKUP(C280,학적,2,FALSE)=\"\",\"\",VLOOKUP(C280,학적,2,FALSE))","v":""},{"$f":"IF(VLOOKUP(C280,평가결과_공통,3,FALSE)=\"\",\"\",IF(메인!$J$7>=1,메인!$F$11,\"\"))","v":""},{"$f":"IF(VLOOKUP(C280,평가결과_공통,3,FALSE)=\"\",\"\",VLOOKUP(C280,평가결과_공통,3,FALSE))","v":""},{"$f":"IF(OR(D280=\"\",COUNTBLANK(F280:F286)=7),\"\",VLOOKUP(D280,평가_교과!$D$7:$X$46,20,FALSE))","v":""},{"$nulls":3},{"$f":"IF(G280=\"\",\"\",LEN(G280))","v":""}]
[{"$nulls":4},{"$f":"IF(VLOOKUP(C280,평가결과_공통,4,FALSE)=\"\",\"\",IF(메인!$J$7>=2,메인!$F$12,\"\"))","v":""},{"$f":"IF(VLOOKUP(C280,평가결과_공통,4,FALSE)=\"\",\"\",VLOOKUP(C280,평가결과_공통,4,FALSE))","v":""}]
[{"$nulls":4},{"$f":"IF(VLOOKUP(C280,평가결과_공통,5,FALSE)=\"\",\"\",IF(메인!$J$7>=3,메인!$F$13,\"\"))","v":""},{"$f":"IF(VLOOKUP(C280,평가결과_공통,5,FALSE)=\"\",\"\",VLOOKUP(C280,평가결과_공통,5,FALSE))","v":""}]
[{"$nulls":4},{"$f":"IF(VLOOKUP(C280,평가결과_공통,6,FALSE)=\"\",\"\",IF(메인!$J$7>=4,메인!$F$14,\"\"))","v":""},{"$f":"IF(VLOOKUP(C280,평가결과_공통,6,FALSE)=\"\",\"\",VLOOKUP(C280,평가결과_공통,6,FALSE))","v":""}]
[{"$nulls":4},{"$f":"IF(VLOOKUP(C280,평가결과_공통,7,FALSE)=\"\",\"\",IF(메인!$J$7>=5,메인!$F$15,\"\"))","v":""},{"$f":"IF(VLOOKUP(C280,평가결과_공통,7,FALSE)=\"\",\"\",VLOOKUP(C280,평가결과_공통,7,FALSE))","v":""}]
[{"$nulls":4},{"$f":"IF(VLOOKUP(C280,평가결과_공통,8,FALSE)=\"\",\"\",IF(메인!$J$7>=6,메인!$F$16,\"\"))","v":""},{"$f":"IF(VLOOKUP(C280,평가결과_공통,8,FALSE)=\"\",\"\",VLOOKUP(C280,평가결과_공통,8,FALSE))","v":""}]
[{"$nulls":4},{"$f":"IF(VLOOKUP(C280,평가결과_공통,9,FALSE)=\"\",\"\",IF(메인!$J$7>=7,메인!$F$17,\"\"))","v":""},{"$f":"IF(VLOOKUP(C280,평가결과_공통,9,FALSE)=\"\",\"\",VLOOKUP(C280,평가결과_공통,9,FALSE))","v":""}]
[{"$nulls":8},{"$f":"메인!D4&\"학업성적관리위원회\"","v":"충남중학교학업성적관리위원회"}]

{"sheet":"NEIS_자유","index":20,"n_rows":287,"n_cols":15,"rows_kept":287,"merged":[[1,2,1,8],[3,5,3,7],[4,2,5,2],[4,3,5,3],[4,4,5,4],[4,5,5,5],[4,6,5,8],[4,10,5,10],[6,2,12,2],[6,3,12,3],[6,6,12,8],[6,10,12,10],[13,2,19,2],[13,3,19,3],[13,6,19,8],[13,10,19,10],[20,2,26,2],[20,3,26,3],[20,6,26,8],[20,10,26,10],[27,2,33,2],[27,3,33,3],[27,6,33,8],[27,10,33,10],[34,2,40,2],[34,3,40,3],[34,6,40,8],[34,10,40,10],[41,2,47,2],[41,3,47,3],[41,6,47,8],[41,10,47,10],[48,2,54,2],[48,3,54,3],[48,6,54,8],[48,10,54,10],[55,2,61,2],[55,3,61,3],[55,6,61,8],[55,10,61,10],[62,2,68,2],[62,3,68,3],[62,6,68,8],[62,10,68,10],[69,2,75,2],[69,3,75,3],[69,6,75,8],[69,10,75,10],[76,2,82,2],[76,3,82,3],[76,6,82,8],[76,10,82,10],[83,2,89,2],[83,3,89,3],[83,6,89,8],[83,10,89,10],[90,2,96,2],[90,3,96,3],[90,6,96,8],[90,10,96,10],[97,2,103,2],[97,3,103,3],[97,6,103,8],[97,10,103,10],[104,2,110,2],[104,3,110,3],[104,6,110,8],[104,10,110,10],[111,2,117,2],[111,3,117,3],[111,6,117,8],[111,10,117,10],[118,2,124,2],[118,3,124,3],[118,6,124,8],[118,10,124,10],[125,2,131,2],[125,3,131,3],[125,6,131,8],[125,10,131,10],[132,2,138,2],[132,3,138,3],[132,6,138,8],[132,10,138,10],[139,2,145,2],[139,3,145,3],[139,6,145,8],[139,10,145,10],[146,2,152,2],[146,3,152,3],[146,6,152,8],[146,10,152,10],[153,2,159,2],[153,3,159,3],[153,6,159,8],[153,10,159,10],[160,2,166,2],[160,3,166,3],[160,6,166,8],[160,10,166,10],[167,2,173,2],[167,3,173,3],[167,6,173,8],[167,10,173,10],[174,2,180,2],[174,3,180,3],[174,6,180,8],[174,10,180,10],[181,2,187,2],[181,3,187,3],[181,6,187,8],[181,10,187,10],[188,2,194,2],[188,3,194,3],[188,6,194,8],[188,10,194,10],[195,2,201,2],[195,3,201,3],[195,6,201,8],[195,10,201,10],[202,2,208,2],[202,3,208,3],[202,6,208,8],[202,10,208,10],[209,2,215,2],[209,3,215,3],[209,6,215,8],[209,10,215,10],[216,2,222,2],[216,3,222,3],[216,6,222,8],[216,10,222,10],[223,2,229,2],[223,3,229,3],[223,6,229,8],[223,10,229,10],[230,2,236,2],[230,3,236,3],[230,6,236,8],[230,10,236,10],[237,2,243,2],[237,3,243,3],[237,6,243,8],[237,10,243,10],[244,2,250,2],[244,3,250,3],[244,6,250,8],[244,10,250,10],[251,2,257,2],[251,3,257,3],[251,6,257,8],[251,10,257,10],[258,2,264,2],[258,3,264,3],[258,6,264,8],[258,10,264,10],[265,2,271,2],[265,3,271,3],[265,6,271,8],[265,10,271,10],[272,2,278,2],[272,3,278,3],[272,6,278,8],[272,10,278,10],[279,2,285,2],[279,3,285,3],[279,6,285,8],[279,10,285,10]]}
[]
[null,null,{"$f":"\"자유학기 과정 중심 평가 결과 (자유학기 활동 - \"&메인!H8&\")\"","v":"자유학기 과정 중심 평가 결과 (자유학기 활동 - 주제선택 활동)"}]
[]
[null,null,{"$f":"메인!G4&메인!F4&\"  \"&메인!I4&메인!H4&\"  \"&메인!K4&메인!J4&\"  \"&메인!D6&메인!C6&\" - (\"&메인!K8&\")\"","v":"2018학년도  2학기  1학년  1반 - (1기)"},null,null,{"$f":"IF(메인!F8=\"\",\"\",IF(메인!D18=\"\",\"(메인 화면 시트에서 자유학기 활동 프로그램 명칭을 반드시 입력해야 합니다.)\",\"[ \"&메인!D18&\" ]\"&\" / ( \"&메인!F8&\" 차시 )\"))","v":"[ 뚝딱뚝딱 창의공작 ] / ( 17 차시 )"},null,null,{"$f":"\"지도교사 : \"&메인!G8&\"  (인)\"","v":"지도교사 : 이자유  (인)"}]
[null,null,"번\n호","성명","평가 요소","판정","NEIS 입력 서술 내용 : ( NEIS [학생생활]-[자유학기(○○○○)]-[○○○○활동별기록] 에서 '특기사항'으로 입력 )",{"$nulls":3},"글자 수"]
[{"$nulls":14},"<원래 수식>"]
[null,null,1,{"$f":"IF(VLOOKUP(C7,학적,2,FALSE)=\"\",\"\",VLOOKUP(C7,학적,2,FALSE))","v":"학생 1"},{"$f":"IF(VLOOKUP(C7,평가결과_자율,3,FALSE)=\"\",\"\",IF(메인!$J$8>=1,메인!$F$18,\"\"))","v":"재료의 가공"},{"$f":"IF(VLOOKUP(C7,평가결과_자율,3,FALSE)=\"\",\"\",VLOOKUP(C7,평가결과_자율,3,FALSE))","v":"A"},{"$f":"IF(OR(D7=\"\",COUNTBLANK(F7:F13)=7),\"\",VLOOKUP(D7,평가_자유!$D$7:$X$46,20,FALSE))","v":"안전 수칙을 준수하며 도구를 이용한 각종 재료(하드보드지, 우드락, 폼보드, 목재)의 자르기를 원하는 치수와 모양대로 안정감 있게 잘 하였음. 한옥의 짜맞춤 구조물 만들기 과정에 대한 부품 제작 및 조립 기능이 부족하여 완성도가 낮음. 실내외 통로 구조물로서 입체적인 계단의 구성 및 벽면과의 배치가 매우 잘 되었음. 4인 가족의 주거공간 구상과 설계가 평범한 상태에서 주어진 재료를 이용한 주택 구상과 설계는 다소 미흡하나 가공 및 조립과 꾸미기로 모형주택을 적당하게 만들었음."},{"$nulls":3},{"$f":"IF(G7=\"\",\"\",LEN(G7))","v":268},{"$nulls":3},{"$f":"IF(OR(D7=\"\",메인!$D$18=\"\",COUNTBLANK(F7:F13)=7),\"\",IF(OR(F7=\"\",F7=\"전입\",F7=\"전출\"),\"\",VLOOKUP(F7,서술_자율1,2,FALSE))&\" \"&IF(OR(F8=\"\",F8=\"전입\",F8=\"전출\"),\"\",VLOOKUP(F8,서술_자율2,2,FALSE))&\" \"&IF(OR(F9=\"\",F9=\"전입\",F9=\"전출\"),\"\",VLOOKUP(F9,서술_자율3,2,FALSE))&\" \"&IF(OR(F10=\"\",F10=\"전입\",F10=\"전출\"),\"\",VLOOKUP(F10,서술_자율4,2,FALSE))&\" \"&IF(OR(F11=\"\",F11=\"전입\",F11=\"전출\"),\"\",VLOOKUP(F11,서술_자율5,2,FALSE))&\" \"&IF(OR(F12=\"\",F12=\"전입\",F12=\"전출\"),\"\",VLOOKUP(F12,서술_자율6,2,FALSE))&\" \"&IF(OR(F13=\"\",F13=\"전입\",F13=\"전출\"),\"\",VLOOKUP(F13,서술_자율7,2,FALSE)))","v":"안전 수칙을 준수하며 도구를 이용한 각종 재료(하드보드지, 우드락, 폼보드, 목재)의 자르기를 원하는 치수와 모양대로 안정감 있게 잘 하였음. 한옥의 짜맞춤 구조물 만들기 과정에 대한 부품 제작 및 조립 기능이 부족하여 완성도가 낮음. 실내외 통로 구조물로서 입체적인 계단의 구성 및 벽면과의 배치가 매우 잘 되었음. 4인 가족의 주거공간 구상과 설계가 평범한 상태에서 주어진 재료를 이용한 주택 구상과 설계는 다소 미흡하나 가공 및 조립과 꾸미기로 모형주택을 적당하게 만들었음. 교량의 일반적인 구조물에 대한 이해가 많이 부족하여 교각과 상판 및 상부 구조 간 각 연결부의 완성이 잘 되어있지 못함.  "}]
[{"$nulls":4},{"$f":"IF(VLOOKUP(C7,평가결과_자율,4,FALSE)=\"\",\"\",IF(메인!$J$8>=2,메인!$F$19,\"\"))","v":"전통 한옥 목재 맞춤 제작"},{"$f":"IF(VLOOKUP(C7,평가결과_자율,4,FALSE)=\"\",\"\",VLOOKUP(C7,평가결과_자율,4,FALSE))","v":"C"}]
[{"$nulls":4},{"$f":"IF(VLOOKUP(C7,평가결과_자율,5,FALSE)=\"\",\"\",IF(메인!$J$8>=3,메인!$F$20,\"\"))","v":"창의적 계단 모형 만들기"},{"$f":"IF(VLOOKUP(C7,평가결과_자율,5,FALSE)=\"\",\"\",VLOOKUP(C7,평가결과_자율,5,FALSE))","v":"A"}]
[{"$nulls":4},{"$f":"IF(VLOOKUP(C7,평가결과_자율,6,FALSE)=\"\",\"\",IF(메인!$J$8>=4,메인!$F$21,\"\"))","v":"창의적 모형주택 만들기"},{"$f":"IF(VLOOKUP(C7,평가결과_자율,6,FALSE)=\"\",\"\",VLOOKUP(C7,평가결과_자율,6,FALSE))","v":"B"}]
[{"$nulls":4},{"$f":"IF(VLOOKUP(C7,평가결과_자율,7,FALSE)=\"\",\"\",IF(메인!$J$8>=5,메인!$F$22,\"\"))","v":"창의적 교량 만들기"},{"$f":"IF(VLOOKUP(C7,평가결과_자율,7,FALSE)=\"\",\"\",VLOOKUP(C7,평가결과_자율,7,FALSE))","v":"C"}]
[{"$nulls":4},{"$f":"IF(VLOOKUP(C7,평가결과_자율,8,FALSE)=\"\",\"\",IF(메인!$J$8>=6,메인!$F$23,\"\"))","v":""},{"$f":"IF(VLOOKUP(C7,평가결과_자율,8,FALSE)=\"\",\"\",VLOOKUP(C7,평가결과_자율,8,FALSE))","v":""}]
[{"$nulls":4},{"$f":"IF(VLOOKUP(C7,평가결과_자율,9,FALSE)=\"\",\"\",IF(메인!$J$8>=7,메인!$F$24,\"\"))","v":""},{"$f":"IF(VLOOKUP(C7,평가결과_자율,9,FALSE)=\"\",\"\",VLOOKUP(C7,평가결과_자율,9,FALSE))","v":""}]
[null,null,2,{"$f":"IF(VLOOKUP(C14,학적,2,FALSE)=\"\",\"\",VLOOKUP(C14,학적,2,FALSE))","v":"학생 2"},{"$f":"IF(VLOOKUP(C14,평가결과_자율,3,FALSE)=\"\",\"\",IF(메인!$J$8>=1,메인!$F$18,\"\"))","v":""},{"$f":"IF(VLOOKUP(C14,평가결과_자율,3,FALSE)=\"\",\"\",VLOOKUP(C14,평가결과_자율,3,FALSE))","v":""},{"$f":"IF(OR(D14=\"\",COUNTBLANK(F14:F20)=7),\"\",VLOOKUP(D14,평가_자유!$D$7:$X$46,20,FALSE))","v":""},{"$nulls":3},{"$f":"IF(G14=\"\",\"\",LEN(G14))","v":""}]
[{"$nulls":4},{"$f":"IF(VLOOKUP(C14,평가결과_자율,4,FALSE)=\"\",\"\",IF(메인!$J$8>=2,메인!$F$19,\"\"))","v":""},{"$f":"IF(VLOOKUP(C14,평가결과_자율,4,FALSE)=\"\",\"\",VLOOKUP(C14,평가결과_자율,4,FALSE))","v":""}]
[{"$nulls":4},{"$f":"IF(VLOOKUP(C14,평가결과_자율,5,FALSE)=\"\",\"\",IF(메인!$J$8>=3,메인!$F$20,\"\"))","v":""},{"$f":"IF(VLOOKUP(C14,평가결과_자율,5,FALSE)=\"\",\"\",VLOOKUP(C14,평가결과_자율,5,FALSE))","v":""}]
[{"$nulls":4},{"$f":"IF(VLOOKUP(C14,평가결과_자율,6,FALSE)=\"\",\"\",IF(메인!$J$8>=4,메인!$F$21,\"\"))","v":""},{"$f":"IF(VLOOKUP(C14,평가결과_자율,6,FALSE)=\"\",\"\",VLOOKUP(C14,평가결과_자율,6,FALSE))","v":""}]
[{"$nulls":4},{"$f":"IF(VLOOKUP(C14,평가결과_자율,7,FALSE)=\"\",\"\",IF(메인!$J$8>=5,메인!$F$22,\"\"))","v":""},{"$f":"IF(VLOOKUP(C14,평가결과_자율,7,FALSE)=\"\",\"\",VLOOKUP(C14,평가결과_자율,7,FALSE))","v":""}]
[{"$nulls":4},{"$f":"IF(VLOOKUP(C14,평가결과_자율,8,FALSE)=\"\",\"\",IF(메인!$J$8>=6,메인!$F$23,\"\"))","v":""},{"$f":"IF(VLOOKUP(C14,평가결과_자율,8,FALSE)=\"\",\"\",VLOOKUP(C14,평가결과_자율,8,FALSE))","v":""}]
[{"$nulls":4},{"$f":"IF(VLOOKUP(C14,평가결과_자율,9,FALSE)=\"\",\"\",IF(메인!$J$8>=7,메인!$F$24,\"\"))","v":""},{"$f":"IF(VLOOKUP(C14,평가결과_자율,9,FALSE)=\"\",\"\",VLOOKUP(C14,평가결과_자율,9,FALSE))","v":""}]
[null,null,3,{"$f":"IF(VLOOKUP(C21,학적,2,FALSE)=\"\",\"\",VLOOKUP(C21,학적,2,FALSE))","v":"학생 3"},{"$f":"IF(VLOOKUP(C21,평가결과_자율,3,FALSE)=\"\",\"\",IF(메인!$J$8>=1,메인!$F$18,\"\"))","v":"재료의 가공"},{"$f":"IF(VLOOKUP(C21,평가결과_자율,3,FALSE)=\"\",\"\",VLOOKUP(C21,평가결과_자율,3,FALSE))","v":"B"},{"$f":"IF(OR(D21=\"\",COUNTBLANK(F21:F27)=7),\"\",VLOOKUP(D21,평가_자유!$D$7:$X$46,20,FALSE))","v":"안전 수칙을 준수하였으나 도구를 이용한 각종 재료(하드보드지, 우드락, 폼보드, 목재)의 자르기에서 일부 재료는 원하는 치수와 모양대로 처리함이 다소 부족하였음. 한옥의 짜맞춤 구조물 부품의 제작과 조립이 양호하여 일반적인 작품으로서의 완성을 하였음. 실내외 통로 구조물로서 단순한 계단의 구성 및 벽면과의 배치가 양호한 편임. 4인 가족의 주거공간 구상과 설계가 부족한 상태에서 주어진 재료를 이용한 주택 구상과 설계가 미흡하고 부품 가공과 조립 및 꾸미기 작업이 대체로 서툴렀음."},{"$nulls":3},{"$f":"IF(G21=\"\",\"\",LEN(G21))","v":270}]
[{"$nulls":4},{"$f":"IF(VLOOKUP(C21,평가결과_자율,4,FALSE)=\"\",\"\",IF(메인!$J$8>=2,메인!$F$19,\"\"))","v":"전통 한옥 목재 맞춤 제작"},{"$f":"IF(VLOOKUP(C21,평가결과_자율,4,FALSE)=\"\",\"\",VLOOKUP(C21,평가결과_자율,4,FALSE))","v":"B"}]
[{"$nulls":4},{"$f":"IF(VLOOKUP(C21,평가결과_자율,5,FALSE)=\"\",\"\",IF(메인!$J$8>=3,메인!$F$20,\"\"))","v":"창의적 계단 모형 만들기"},{"$f":"IF(VLOOKUP(C21,평가결과_자율,5,FALSE)=\"\",\"\",VLOOKUP(C21,평가결과_자율,5,FALSE))","v":"B"}]
[{"$nulls":4},{"$f":"IF(VLOOKUP(C21,평가결과_자율,6,FALSE)=\"\",\"\",IF(메인!$J$8>=4,메인!$F$21,\"\"))","v":"창의적 모형주택 만들기"},{"$f":"IF(VLOOKUP(C21,평가결과_자율,6,FALSE)=\"\",\"\",VLOOKUP(C21,평가결과_자율,6,FALSE))","v":"C"}]
[{"$nulls":4},{"$f":"IF(VLOOKUP(C21,평가결과_자율,7,FALSE)=\"\",\"\",IF(메인!$J$8>=5,메인!$F$22,\"\"))","v":"창의적 교량 만들기"},{"$f":"IF(VLOOKUP(C21,평가결과_자율,7,FALSE)=\"\",\"\",VLOOKUP(C21,평가결과_자율,7,FALSE))","v":"A"}]
[{"$nulls":4},{"$f":"IF(VLOOKUP(C21,평가결과_자율,8,FALSE)=\"\",\"\",IF(메인!$J$8>=6,메인!$F$23,\"\"))","v":""},{"$f":"IF(VLOOKUP(C21,평가결과_자율,8,FALSE)=\"\",\"\",VLOOKUP(C21,평가결과_자율,8,FALSE))","v":""}]
[{"$nulls":4},{"$f":"IF(VLOOKUP(C21,평가결과_자율,9,FALSE)=\"\",\"\",IF(메인!$J$8>=7,메인!$F$24,\"\"))","v":""},{"$f":"IF(VLOOKUP(C21,평가결과_자율,9,FALSE)=\"\",\"\",VLOOKUP(C21,평가결과_자율,9,FALSE))","v":""}]
[null,null,4,{"$f":"IF(VLOOKUP(C28,학적,2,FALSE)=\"\",\"\",VLOOKUP(C28,학적,2,FALSE))","v":"학생 4"},{"$f":"IF(VLOOKUP(C28,평가결과_자율,3,FALSE)=\"\",\"\",IF(메인!$J$8>=1,메인!$F$18,\"\"))","v":""},{"$f":"IF(VLOOKUP(C28,평가결과_자율,3,FALSE)=\"\",\"\",VLOOKUP(C28,평가결과_자율,3,FALSE))","v":""},{"$f":"IF(OR(D28=\"\",COUNTBLANK(F28:F34)=7),\"\",VLOOKUP(D28,평가_자유!$D$7:$X$46,20,FALSE))","v":""},{"$nulls":3},{"$f":"IF(G28=\"\",\"\",LEN(G28))","v":""}]
[{"$nulls":4},{"$f":"IF(VLOOKUP(C28,평가결과_자율,4,FALSE)=\"\",\"\",IF(메인!$J$8>=2,메인!$F$19,\"\"))","v":""},{"$f":"IF(VLOOKUP(C28,평가결과_자율,4,FALSE)=\"\",\"\",VLOOKUP(C28,평가결과_자율,4,FALSE))","v":""}]
[{"$nulls":4},{"$f":"IF(VLOOKUP(C28,평가결과_자율,5,FALSE)=\"\",\"\",IF(메인!$J$8>=3,메인!$F$20,\"\"))","v":""},{"$f":"IF(VLOOKUP(C28,평가결과_자율,5,FALSE)=\"\",\"\",VLOOKUP(C28,평가결과_자율,5,FALSE))","v":""}]
[{"$nulls":4},{"$f":"IF(VLOOKUP(C28,평가결과_자율,6,FALSE)=\"\",\"\",IF(메인!$J$8>=4,메인!$F$21,\"\"))","v":""},{"$f":"IF(VLOOKUP(C28,평가결과_자율,6,FALSE)=\"\",\"\",VLOOKUP(C28,평가결과_자율,6,FALSE))","v":""}]
[{"$nulls":4},{"$f":"IF(VLOOKUP(C28,평가결과_자율,7,FALSE)=\"\",\"\",IF(메인!$J$8>=5,메인!$F$22,\"\"))","v":""},{"$f":"IF(VLOOKUP(C28,평가결과_자율,7,FALSE)=\"\",\"\",VLOOKUP(C28,평가결과_자율,7,FALSE))","v":""}]
[{"$nulls":4},{"$f":"IF(VLOOKUP(C28,평가결과_자율,8,FALSE)=\"\",\"\",IF(메인!$J$8>=6,메인!$F$23,\"\"))","v":""},{"$f":"IF(VLOOKUP(C28,평가결과_자율,8,FALSE)=\"\",\"\",VLOOKUP(C28,평가결과_자율,8,FALSE))","v":""}]
[{"$nulls":4},{"$f":"IF(VLOOKUP(C28,평가결과_자율,9,FALSE)=\"\",\"\",IF(메인!$J$8>=7,메인!$F$24,\"\"))","v":""},{"$f":"IF(VLOOKUP(C28,평가결과_자율,9,FALSE)=\"\",\"\",VLOOKUP(C28,평가결과_자율,9,FALSE))","v":""}]
[null,null,5,{"$f":"IF(VLOOKUP(C35,학적,2,FALSE)=\"\",\"\",VLOOKUP(C35,학적,2,FALSE))","v":"학생 5"},{"$f":"IF(VLOOKUP(C35,평가결과_자율,3,FALSE)=\"\",\"\",IF(메인!$J$8>=1,메인!$F$18,\"\"))","v":"재료의 가공"},{"$f":"IF(VLOOKUP(C35,평가결과_자율,3,FALSE)=\"\",\"\",VLOOKUP(C35,평가결과_자율,3,FALSE))","v":"A"},{"$f":"IF(OR(D35=\"\",COUNTBLANK(F35:F41)=7),\"\",VLOOKUP(D35,평가_자유!$D$7:$X$46,20,FALSE))","v":"안전 수칙을 준수하며 도구를 이용한 각종 재료(하드보드지, 우드락, 폼보드, 목재)의 자르기를 원하는 치수와 모양대로 안정감 있게 잘 하였음. 한옥의 짜맞춤 구조물 만들기에서 부품의 제작이 정확하고 조립이 견고하여 완성도가 높음. 실내외 통로 구조물로서 단순한 계단의 구성 및 벽면과의 배치가 양호한 편임. 4인 가족의 주거공간 구상과 설계가 부족한 상태에서 주어진 재료를 이용한 주택 구상과 설계가 미흡하고 부품 가공과 조립 및 꾸미기 작업이 대체로 서툴렀음."},{"$nulls":3},{"$f":"IF(G35=\"\",\"\",LEN(G35))","v":258}]
[{"$nulls":4},{"$f":"IF(VLOOKUP(C35,평가결과_자율,4,FALSE)=\"\",\"\",IF(메인!$J$8>=2,메인!$F$19,\"\"))","v":"전통 한옥 목재 맞춤 제작"},{"$f":"IF(VLOOKUP(C35,평가결과_자율,4,FALSE)=\"\",\"\",VLOOKUP(C35,평가결과_자율,4,FALSE))","v":"A"}]
[{"$nulls":4},{"$f":"IF(VLOOKUP(C35,평가결과_자율,5,FALSE)=\"\",\"\",IF(메인!$J$8>=3,메인!$F$20,\"\"))","v":"창의적 계단 모형 만들기"},{"$f":"IF(VLOOKUP(C35,평가결과_자율,5,FALSE)=\"\",\"\",VLOOKUP(C35,평가결과_자율,5,FALSE))","v":"B"}]
[{"$nulls":4},{"$f":"IF(VLOOKUP(C35,평가결과_자율,6,FALSE)=\"\",\"\",IF(메인!$J$8>=4,메인!$F$21,\"\"))","v":"창의적 모형주택 만들기"},{"$f":"IF(VLOOKUP(C35,평가결과_자율,6,FALSE)=\"\",\"\",VLOOKUP(C35,평가결과_자율,6,FALSE))","v":"C"}]
[{"$nulls":4},{"$f":"IF(VLOOKUP(C35,평가결과_자율,7,FALSE)=\"\",\"\",IF(메인!$J$8>=5,메인!$F$22,\"\"))","v":"창의적 교량 만들기"},{"$f":"IF(VLOOKUP(C35,평가결과_자율,7,FALSE)=\"\",\"\",VLOOKUP(C35,평가결과_자율,7,FALSE))","v":"A"}]
[{"$nulls":4},{"$f":"IF(VLOOKUP(C35,평가결과_자율,8,FALSE)=\"\",\"\",IF(메인!$J$8>=6,메인!$F$23,\"\"))","v":""},{"$f":"IF(VLOOKUP(C35,평가결과_자율,8,FALSE)=\"\",\"\",VLOOKUP(C35,평가결과_자율,8,FALSE))","v":""}]
[{"$nulls":4},{"$f":"IF(VLOOKUP(C35,평가결과_자율,9,FALSE)=\"\",\"\",IF(메인!$J$8>=7,메인!$F$24,\"\"))","v":""},{"$f":"IF(VLOOKUP(C35,평가결과_자율,9,FALSE)=\"\",\"\",VLOOKUP(C35,평가결과_자율,9,FALSE))","v":""}]
[null,null,6,{"$f":"IF(VLOOKUP(C42,학적,2,FALSE)=\"\",\"\",VLOOKUP(C42,학적,2,FALSE))","v":"학생 6"},{"$f":"IF(VLOOKUP(C42,평가결과_자율,3,FALSE)=\"\",\"\",IF(메인!$J$8>=1,메인!$F$18,\"\"))","v":"재료의 가공"},{"$f":"IF(VLOOKUP(C42,평가결과_자율,3,FALSE)=\"\",\"\",VLOOKUP(C42,평가결과_자율,3,FALSE))","v":"B"},{"$f":"IF(OR(D42=\"\",COUNTBLANK(F42:F48)=7),\"\",VLOOKUP(D42,평가_자유!$D$7:$X$46,20,FALSE))","v":"안전 수칙을 준수하였으나 도구를 이용한 각종 재료(하드보드지, 우드락, 폼보드, 목재)의 자르기에서 일부 재료는 원하는 치수와 모양대로 처리함이 다소 부족하였음. 한옥의 짜맞춤 구조물 만들기 과정에 대한 부품 제작 및 조립 기능이 부족하여 완성도가 낮음. 실내외 통로 구조물로서 단순한 계단의 구성 및 벽면과의 배치가 양호한 편임. 4인 가족의 주거공간 구상과 설계가 잘된 상태에서 주어진 재료를 이용한 부품 가공과 조립 및 꾸미기로 모형주택을 잘 만들었음."},{"$nulls":3},{"$f":"IF(G42=\"\",\"\",LEN(G42))","v":256}]
[{"$nulls":4},{"$f":"IF(VLOOKUP(C42,평가결과_자율,4,FALSE)=\"\",\"\",IF(메인!$J$8>=2,메인!$F$19,\"\"))","v":"전통 한옥 목재 맞춤 제작"},{"$f":"IF(VLOOKUP(C42,평가결과_자율,4,FALSE)=\"\",\"\",VLOOKUP(C42,평가결과_자율,4,FALSE))","v":"C"}]
[{"$nulls":4},{"$f":"IF(VLOOKUP(C42,평가결과_자율,5,FALSE)=\"\",\"\",IF(메인!$J$8>=3,메인!$F$20,\"\"))","v":"창의적 계단 모형 만들기"},{"$f":"IF(VLOOKUP(C42,평가결과_자율,5,FALSE)=\"\",\"\",VLOOKUP(C42,평가결과_자율,5,FALSE))","v":"B"}]
[{"$nulls":4},{"$f":"IF(VLOOKUP(C42,평가결과_자율,6,FALSE)=\"\",\"\",IF(메인!$J$8>=4,메인!$F$21,\"\"))","v":"창의적 모형주택 만들기"},{"$f":"IF(VLOOKUP(C42,평가결과_자율,6,FALSE)=\"\",\"\",VLOOKUP(C42,평가결과_자율,6,FALSE))","v":"A"}]
[{"$nulls":4},{"$f":"IF(VLOOKUP(C42,평가결과_자율,7,FALSE)=\"\",\"\",IF(메인!$J$8>=5,메인!$F$22,\"\"))","v":"창의적 교량 만들기"},{"$f":"IF(VLOOKUP(C42,평가결과_자율,7,FALSE)=\"\",\"\",VLOOKUP(C42,평가결과_자율,7,FALSE))","v":"A"}]
[{"$nulls":4},{"$f":"IF(VLOOKUP(C42,평가결과_자율,8,FALSE)=\"\",\"\",IF(메인!$J$8>=6,메인!$F$23,\"\"))","v":""},{"$f":"IF(VLOOKUP(C42,평가결과_자율,8,FALSE)=\"\",\"\",VLOOKUP(C42,평가결과_자율,8,FALSE))","v":""}]
[{"$nulls":4},{"$f":"IF(VLOOKUP(C42,평가결과_자율,9,FALSE)=\"\",\"\",IF(메인!$J$8>=7,메인!$F$24,\"\"))","v":""},{"$f":"IF(VLOOKUP(C42,평가결과_자율,9,FALSE)=\"\",\"\",VLOOKUP(C42,평가결과_자율,9,FALSE))","v":""}]
[null,null,7,{"$f":"IF(VLOOKUP(C49,학적,2,FALSE)=\"\",\"\",VLOOKUP(C49,학적,2,FALSE))","v":"학생 7"},{"$f":"IF(VLOOKUP(C49,평가결과_자율,3,FALSE)=\"\",\"\",IF(메인!$J$8>=1,메인!$F$18,\"\"))","v":"재료의 가공"},{"$f":"IF(VLOOKUP(C49,평가결과_자율,3,FALSE)=\"\",\"\",VLOOKUP(C49,평가결과_자율,3,FALSE))","v":"B"},{"$f":"IF(OR(D49=\"\",COUNTBLANK(F49:F55)=7),\"\",VLOOKUP(D49,평가_자유!$D$7:$X$46,20,FALSE))","v":"안전 수칙을 준수하였으나 도구를 이용한 각종 재료(하드보드지, 우드락, 폼보드, 목재)의 자르기에서 일부 재료는 원하는 치수와 모양대로 처리함이 다소 부족하였음. 한옥의 짜맞춤 구조물 만들기에서 부품의 제작이 정확하고 조립이 견고하여 완성도가 높음. 실내외 통로 구조물로서 단순한 계단의 구성 및 벽면과의 배치가 양호한 편임. 4인 가족의 주거공간 구상과 설계가 평범한 상태에서 주어진 재료를 이용한 주택 구상과 설계는 다소 미흡하나 가공 및 조립과 꾸미기로 모형주택을 적당하게 만들었음."},{"$nulls":3},{"$f":"IF(G49=\"\",\"\",LEN(G49))","v":273}]
[{"$nulls":4},{"$f":"IF(VLOOKUP(C49,평가결과_자율,4,FALSE)=\"\",\"\",IF(메인!$J$8>=2,메인!$F$19,\"\"))","v":"전통 한옥 목재 맞춤 제작"},{"$f":"IF(VLOOKUP(C49,평가결과_자율,4,FALSE)=\"\",\"\",VLOOKUP(C49,평가결과_자율,4,FALSE))","v":"A"}]
[{"$nulls":4},{"$f":"IF(VLOOKUP(C49,평가결과_자율,5,FALSE)=\"\",\"\",IF(메인!$J$8>=3,메인!$F$20,\"\"))","v":"창의적 계단 모형 만들기"},{"$f":"IF(VLOOKUP(C49,평가결과_자율,5,FALSE)=\"\",\"\",VLOOKUP(C49,평가결과_자율,5,FALSE))","v":"B"}]
[{"$nulls":4},{"$f":"IF(VLOOKUP(C49,평가결과_자율,6,FALSE)=\"\",\"\",IF(메인!$J$8>=4,메인!$F$21,\"\"))","v":"창의적 모형주택 만들기"},{"$f":"IF(VLOOKUP(C49,평가결과_자율,6,FALSE)=\"\",\"\",VLOOKUP(C49,평가결과_자율,6,FALSE))","v":"B"}]
[{"$nulls":4},{"$f":"IF(VLOOKUP(C49,평가결과_자율,7,FALSE)=\"\",\"\",IF(메인!$J$8>=5,메인!$F$22,\"\"))","v":"창의적 교량 만들기"},{"$f":"IF(VLOOKUP(C49,평가결과_자율,7,FALSE)=\"\",\"\",VLOOKUP(C49,평가결과_자율,7,FALSE))","v":"A"}]
[{"$nulls":4},{"$f":"IF(VLOOKUP(C49,평가결과_자율,8,FALSE)=\"\",\"\",IF(메인!$J$8>=6,메인!$F$23,\"\"))","v":""},{"$f":"IF(VLOOKUP(C49,평가결과_자율,8,FALSE)=\"\",\"\",VLOOKUP(C49,평가결과_자율,8,FALSE))","v":""}]
[{"$nulls":4},{"$f":"IF(VLOOKUP(C49,평가결과_자율,9,FALSE)=\"\",\"\",IF(메인!$J$8>=7,메인!$F$24,\"\"))","v":""},{"$f":"IF(VLOOKUP(C49,평가결과_자율,9,FALSE)=\"\",\"\",VLOOKUP(C49,평가결과_자율,9,FALSE))","v":""}]
[null,null,8,{"$f":"IF(VLOOKUP(C56,학적,2,FALSE)=\"\",\"\",VLOOKUP(C56,학적,2,FALSE))","v":"학생 8"},{"$f":"IF(VLOOKUP(C56,평가결과_자율,3,FALSE)=\"\",\"\",IF(메인!$J$8>=1,메인!$F$18,\"\"))","v":"재료의 가공"},{"$f":"IF(VLOOKUP(C56,평가결과_자율,3,FALSE)=\"\",\"\",VLOOKUP(C56,평가결과_자율,3,FALSE))","v":"A"},{"$f":"IF(OR(D56=\"\",COUNTBLANK(F56:F62)=7),\"\",VLOOKUP(D56,평가_자유!$D$7:$X$46,20,FALSE))","v":"안전 수칙을 준수하며 도구를 이용한 각종 재료(하드보드지, 우드락, 폼보드, 목재)의 자르기를 원하는 치수와 모양대로 안정감 있게 잘 하였음. 한옥의 짜맞춤 구조물 부품의 제작과 조립이 양호하여 일반적인 작품으로서의 완성을 하였음. 실내외 통로 구조물로서 단순한 계단의 구성 및 벽면과의 배치가 양호한 편임. 4인 가족의 주거공간 구상과 설계가 부족한 상태에서 주어진 재료를 이용한 주택 구상과 설계가 미흡하고 부품 가공과 조립 및 꾸미기 작업이 대체로 서툴렀음."},{"$nulls":3},{"$f":"IF(G56=\"\",\"\",LEN(G56))","v":259}]
[{"$nulls":4},{"$f":"IF(VLOOKUP(C56,평가결과_자율,4,FALSE)=\"\",\"\",IF(메인!$J$8>=2,메인!$F$19,\"\"))","v":"전통 한옥 목재 맞춤 제작"},{"$f":"IF(VLOOKUP(C56,평가결과_자율,4,FALSE)=\"\",\"\",VLOOKUP(C56,평가결과_자율,4,FALSE))","v":"B"}]
[{"$nulls":4},{"$f":"IF(VLOOKUP(C56,평가결과_자율,5,FALSE)=\"\",\"\",IF(메인!$J$8>=3,메인!$F$20,\"\"))","v":"창의적 계단 모형 만들기"},{"$f":"IF(VLOOKUP(C56,평가결과_자율,5,FALSE)=\"\",\"\",VLOOKUP(C56,평가결과_자율,5,FALSE))","v":"B"}]
[{"$nulls":4},{"$f":"IF(VLOOKUP(C56,평가결과_자율,6,FALSE)=\"\",\"\",IF(메인!$J$8>=4,메인!$F$21,\"\"))","v":"창의적 모형주택 만들기"},{"$f":"IF(VLOOKUP(C56,평가결과_자율,6,FALSE)=\"\",\"\",VLOOKUP(C56,평가결과_자율,6,FALSE))","v":"C"}]
[{"$nulls":4},{"$f":"IF(VLOOKUP(C56,평가결과_자율,7,FALSE)=\"\",\"\",IF(메인!$J$8>=5,메인!$F$22,\"\"))","v":"창의적 교량 만들기"},{"$f":"IF(VLOOKUP(C56,평가결과_자율,7,FALSE)=\"\",\"\",VLOOKUP(C56,평가결과_자율,7,FALSE))","v":"B"}]
[{"$nulls":4},{"$f":"IF(VLOOKUP(C56,평가결과_자율,8,FALSE)=\"\",\"\",IF(메인!$J$8>=6,메인!$F$23,\"\"))","v":""},{"$f":"IF(VLOOKUP(C56,평가결과_자율,8,FALSE)=\"\",\"\",VLOOKUP(C56,평가결과_자율,8,FALSE))","v":""}]
[{"$nulls":4},{"$f":"IF(VLOOKUP(C56,평가결과_자율,9,FALSE)=\"\",\"\",IF(메인!$J$8>=7,메인!$F$24,\"\"))","v":""},{"$f":"IF(VLOOKUP(C56,평가결과_자율,9,FALSE)=\"\",\"\",VLOOKUP(C56,평가결과_자율,9,FALSE))","v":""}]
[null,null,9,{"$f":"IF(VLOOKUP(C63,학적,2,FALSE)=\"\",\"\",VLOOKUP(C63,학적,2,FALSE))","v":"학생 9"},{"$f":"IF(VLOOKUP(C63,평가결과_자율,3,FALSE)=\"\",\"\",IF(메인!$J$8>=1,메인!$F$18,\"\"))","v":""},{"$f":"IF(VLOOKUP(C63,평가결과_자율,3,FALSE)=\"\",\"\",VLOOKUP(C63,평가결과_자율,3,FALSE))","v":""},{"$f":"IF(OR(D63=\"\",COUNTBLANK(F63:F69)=7),\"\",VLOOKUP(D63,평가_자유!$D$7:$X$46,20,FALSE))","v":""},{"$nulls":3},{"$f":"IF(G63=\"\",\"\",LEN(G63))","v":""}]
[{"$nulls":4},{"$f":"IF(VLOOKUP(C63,평가결과_자율,4,FALSE)=\"\",\"\",IF(메인!$J$8>=2,메인!$F$19,\"\"))","v":""},{"$f":"IF(VLOOKUP(C63,평가결과_자율,4,FALSE)=\"\",\"\",VLOOKUP(C63,평가결과_자율,4,FALSE))","v":""}]
[{"$nulls":4},{"$f":"IF(VLOOKUP(C63,평가결과_자율,5,FALSE)=\"\",\"\",IF(메인!$J$8>=3,메인!$F$20,\"\"))","v":""},{"$f":"IF(VLOOKUP(C63,평가결과_자율,5,FALSE)=\"\",\"\",VLOOKUP(C63,평가결과_자율,5,FALSE))","v":""}]
[{"$nulls":4},{"$f":"IF(VLOOKUP(C63,평가결과_자율,6,FALSE)=\"\",\"\",IF(메인!$J$8>=4,메인!$F$21,\"\"))","v":""},{"$f":"IF(VLOOKUP(C63,평가결과_자율,6,FALSE)=\"\",\"\",VLOOKUP(C63,평가결과_자율,6,FALSE))","v":""}]
[{"$nulls":4},{"$f":"IF(VLOOKUP(C63,평가결과_자율,7,FALSE)=\"\",\"\",IF(메인!$J$8>=5,메인!$F$22,\"\"))","v":""},{"$f":"IF(VLOOKUP(C63,평가결과_자율,7,FALSE)=\"\",\"\",VLOOKUP(C63,평가결과_자율,7,FALSE))","v":""}]
[{"$nulls":4},{"$f":"IF(VLOOKUP(C63,평가결과_자율,8,FALSE)=\"\",\"\",IF(메인!$J$8>=6,메인!$F$23,\"\"))","v":""},{"$f":"IF(VLOOKUP(C63,평가결과_자율,8,FALSE)=\"\",\"\",VLOOKUP(C63,평가결과_자율,8,FALSE))","v":""}]
[{"$nulls":4},{"$f":"IF(VLOOKUP(C63,평가결과_자율,9,FALSE)=\"\",\"\",IF(메인!$J$8>=7,메인!$F$24,\"\"))","v":""},{"$f":"IF(VLOOKUP(C63,평가결과_자율,9,FALSE)=\"\",\"\",VLOOKUP(C63,평가결과_자율,9,FALSE))","v":""}]
[null,null,10,{"$f":"IF(VLOOKUP(C70,학적,2,FALSE)=\"\",\"\",VLOOKUP(C70,학적,2,FALSE))","v":"학생10"},{"$f":"IF(VLOOKUP(C70,평가결과_자율,3,FALSE)=\"\",\"\",IF(메인!$J$8>=1,메인!$F$18,\"\"))","v":""},{"$f":"IF(VLOOKUP(C70,평가결과_자율,3,FALSE)=\"\",\"\",VLOOKUP(C70,평가결과_자율,3,FALSE))","v":""},{"$f":"IF(OR(D70=\"\",COUNTBLANK(F70:F76)=7),\"\",VLOOKUP(D70,평가_자유!$D$7:$X$46,20,FALSE))","v":""},{"$nulls":3},{"$f":"IF(G70=\"\",\"\",LEN(G70))","v":""}]
[{"$nulls":4},{"$f":"IF(VLOOKUP(C70,평가결과_자율,4,FALSE)=\"\",\"\",IF(메인!$J$8>=2,메인!$F$19,\"\"))","v":""},{"$f":"IF(VLOOKUP(C70,평가결과_자율,4,FALSE)=\"\",\"\",VLOOKUP(C70,평가결과_자율,4,FALSE))","v":""}]
[{"$nulls":4},{"$f":"IF(VLOOKUP(C70,평가결과_자율,5,FALSE)=\"\",\"\",IF(메인!$J$8>=3,메인!$F$20,\"\"))","v":""},{"$f":"IF(VLOOKUP(C70,평가결과_자율,5,FALSE)=\"\",\"\",VLOOKUP(C70,평가결과_자율,5,FALSE))","v":""}]
[{"$nulls":4},{"$f":"IF(VLOOKUP(C70,평가결과_자율,6,FALSE)=\"\",\"\",IF(메인!$J$8>=4,메인!$F$21,\"\"))","v":""},{"$f":"IF(VLOOKUP(C70,평가결과_자율,6,FALSE)=\"\",\"\",VLOOKUP(C70,평가결과_자율,6,FALSE))","v":""}]
[{"$nulls":4},{"$f":"IF(VLOOKUP(C70,평가결과_자율,7,FALSE)=\"\",\"\",IF(메인!$J$8>=5,메인!$F$22,\"\"))","v":""},{"$f":"IF(VLOOKUP(C70,평가결과_자율,7,FALSE)=\"\",\"\",VLOOKUP(C70,평가결과_자율,7,FALSE))","v":""}]
[{"$nulls":4},{"$f":"IF(VLOOKUP(C70,평가결과_자율,8,FALSE)=\"\",\"\",IF(메인!$J$8>=6,메인!$F$23,\"\"))","v":""},{"$f":"IF(VLOOKUP(C70,평가결과_자율,8,FALSE)=\"\",\"\",VLOOKUP(C70,평가결과_자율,8,FALSE))","v":""}]
[{"$nulls":4},{"$f":"IF(VLOOKUP(C70,평가결과_자율,9,FALSE)=\"\",\"\",IF(메인!$J$8>=7,메인!$F$24,\"\"))","v":""},{"$f":"IF(VLOOKUP(C70,평가결과_자율,9,FALSE)=\"\",\"\",VLOOKUP(C70,평가결과_자율,9,FALSE))","v":""}]
[null,null,11,{"$f":"IF(VLOOKUP(C77,학적,2,FALSE)=\"\",\"\",VLOOKUP(C77,학적,2,FALSE))","v":"학생11"},{"$f":"IF(VLOOKUP(C77,평가결과_자율,3,FALSE)=\"\",\"\",IF(메인!$J$8>=1,메인!$F$18,\"\"))","v":"재료의 가공"},{"$f":"IF(VLOOKUP(C77,평가결과_자율,3,FALSE)=\"\",\"\",VLOOKUP(C77,평가결과_자율,3,FALSE))","v":"A"},{"$f":"IF(OR(D77=\"\",COUNTBLANK(F77:F83)=7),\"\",VLOOKUP(D77,평가_자유!$D$7:$X$46,20,FALSE))","v":"안전 수칙을 준수하며 도구를 이용한 각종 재료(하드보드지, 우드락, 폼보드, 목재)의 자르기를 원하는 치수와 모양대로 안정감 있게 잘 하였음. 한옥의 짜맞춤 구조물 만들기에서 부품의 제작이 정확하고 조립이 견고하여 완성도가 높음. 실내외 통로 구조물로서 입체적인 계단의 구성 및 벽면과의 배치가 매우 잘 되었음. 4인 가족의 주거공간 구상과 설계가 평범한 상태에서 주어진 재료를 이용한 주택 구상과 설계는 다소 미흡하나 가공 및 조립과 꾸미기로 모형주택을 적당하게 만들었음."},{"$nulls":3},{"$f":"IF(G77=\"\",\"\",LEN(G77))","v":265}]
[{"$nulls":4},{"$f":"IF(VLOOKUP(C77,평가결과_자율,4,FALSE)=\"\",\"\",IF(메인!$J$8>=2,메인!$F$19,\"\"))","v":"전통 한옥 목재 맞춤 제작"},{"$f":"IF(VLOOKUP(C77,평가결과_자율,4,FALSE)=\"\",\"\",VLOOKUP(C77,평가결과_자율,4,FALSE))","v":"A"}]
[{"$nulls":4},{"$f":"IF(VLOOKUP(C77,평가결과_자율,5,FALSE)=\"\",\"\",IF(메인!$J$8>=3,메인!$F$20,\"\"))","v":"창의적 계단 모형 만들기"},{"$f":"IF(VLOOKUP(C77,평가결과_자율,5,FALSE)=\"\",\"\",VLOOKUP(C77,평가결과_자율,5,FALSE))","v":"A"}]
[{"$nulls":4},{"$f":"IF(VLOOKUP(C77,평가결과_자율,6,FALSE)=\"\",\"\",IF(메인!$J$8>=4,메인!$F$21,\"\"))","v":"창의적 모형주택 만들기"},{"$f":"IF(VLOOKUP(C77,평가결과_자율,6,FALSE)=\"\",\"\",VLOOKUP(C77,평가결과_자율,6,FALSE))","v":"B"}]
[{"$nulls":4},{"$f":"IF(VLOOKUP(C77,평가결과_자율,7,FALSE)=\"\",\"\",IF(메인!$J$8>=5,메인!$F$22,\"\"))","v":"창의적 교량 만들기"},{"$f":"IF(VLOOKUP(C77,평가결과_자율,7,FALSE)=\"\",\"\",VLOOKUP(C77,평가결과_자율,7,FALSE))","v":"B"}]
[{"$nulls":4},{"$f":"IF(VLOOKUP(C77,평가결과_자율,8,FALSE)=\"\",\"\",IF(메인!$J$8>=6,메인!$F$23,\"\"))","v":""},{"$f":"IF(VLOOKUP(C77,평가결과_자율,8,FALSE)=\"\",\"\",VLOOKUP(C77,평가결과_자율,8,FALSE))","v":""}]
[{"$nulls":4},{"$f":"IF(VLOOKUP(C77,평가결과_자율,9,FALSE)=\"\",\"\",IF(메인!$J$8>=7,메인!$F$24,\"\"))","v":""},{"$f":"IF(VLOOKUP(C77,평가결과_자율,9,FALSE)=\"\",\"\",VLOOKUP(C77,평가결과_자율,9,FALSE))","v":""}]
[null,null,12,{"$f":"IF(VLOOKUP(C84,학적,2,FALSE)=\"\",\"\",VLOOKUP(C84,학적,2,FALSE))","v":"학생12"},{"$f":"IF(VLOOKUP(C84,평가결과_자율,3,FALSE)=\"\",\"\",IF(메인!$J$8>=1,메인!$F$18,\"\"))","v":""},{"$f":"IF(VLOOKUP(C84,평가결과_자율,3,FALSE)=\"\",\"\",VLOOKUP(C84,평가결과_자율,3,FALSE))","v":""},{"$f":"IF(OR(D84=\"\",COUNTBLANK(F84:F90)=7),\"\",VLOOKUP(D84,평가_자유!$D$7:$X$46,20,FALSE))","v":""},{"$nulls":3},{"$f":"IF(G84=\"\",\"\",LEN(G84))","v":""}]
[{"$nulls":4},{"$f":"IF(VLOOKUP(C84,평가결과_자율,4,FALSE)=\"\",\"\",IF(메인!$J$8>=2,메인!$F$19,\"\"))","v":""},{"$f":"IF(VLOOKUP(C84,평가결과_자율,4,FALSE)=\"\",\"\",VLOOKUP(C84,평가결과_자율,4,FALSE))","v":""}]
[{"$nulls":4},{"$f":"IF(VLOOKUP(C84,평가결과_자율,5,FALSE)=\"\",\"\",IF(메인!$J$8>=3,메인!$F$20,\"\"))","v":""},{"$f":"IF(VLOOKUP(C84,평가결과_자율,5,FALSE)=\"\",\"\",VLOOKUP(C84,평가결과_자율,5,FALSE))","v":""}]
[{"$nulls":4},{"$f":"IF(VLOOKUP(C84,평가결과_자율,6,FALSE)=\"\",\"\",IF(메인!$J$8>=4,메인!$F$21,\"\"))","v":""},{"$f":"IF(VLOOKUP(C84,평가결과_자율,6,FALSE)=\"\",\"\",VLOOKUP(C84,평가결과_자율,6,FALSE))","v":""}]
[{"$nulls":4},{"$f":"IF(VLOOKUP(C84,평가결과_자율,7,FALSE)=\"\",\"\",IF(메인!$J$8>=5,메인!$F$22,\"\"))","v":""},{"$f":"IF(VLOOKUP(C84,평가결과_자율,7,FALSE)=\"\",\"\",VLOOKUP(C84,평가결과_자율,7,FALSE))","v":""}]
[{"$nulls":4},{"$f":"IF(VLOOKUP(C84,평가결과_자율,8,FALSE)=\"\",\"\",IF(메인!$J$8>=6,메인!$F$23,\"\"))","v":""},{"$f":"IF(VLOOKUP(C84,평가결과_자율,8,FALSE)=\"\",\"\",VLOOKUP(C84,평가결과_자율,8,FALSE))","v":""}]
[{"$nulls":4},{"$f":"IF(VLOOKUP(C84,평가결과_자율,9,FALSE)=\"\",\"\",IF(메인!$J$8>=7,메인!$F$24,\"\"))","v":""},{"$f":"IF(VLOOKUP(C84,평가결과_자율,9,FALSE)=\"\",\"\",VLOOKUP(C84,평가결과_자율,9,FALSE))","v":""}]
[null,null,13,{"$f":"IF(VLOOKUP(C91,학적,2,FALSE)=\"\",\"\",VLOOKUP(C91,학적,2,FALSE))","v":"학생13"},{"$f":"IF(VLOOKUP(C91,평가결과_자율,3,FALSE)=\"\",\"\",IF(메인!$J$8>=1,메인!$F$18,\"\"))","v":"재료의 가공"},{"$f":"IF(VLOOKUP(C91,평가결과_자율,3,FALSE)=\"\",\"\",VLOOKUP(C91,평가결과_자율,3,FALSE))","v":"B"},{"$f":"IF(OR(D91=\"\",COUNTBLANK(F91:F97)=7),\"\",VLOOKUP(D91,평가_자유!$D$7:$X$46,20,FALSE))","v":"안전 수칙을 준수하였으나 도구를 이용한 각종 재료(하드보드지, 우드락, 폼보드, 목재)의 자르기에서 일부 재료는 원하는 치수와 모양대로 처리함이 다소 부족하였음. 한옥의 짜맞춤 구조물 만들기 과정에 대한 부품 제작 및 조립 기능이 부족하여 완성도가 낮음. 실내외 통로 구조물로서 단순한 계단의 구성 및 벽면과의 배치가 양호한 편임. 4인 가족의 주거공간 구상과 설계가 잘된 상태에서 주어진 재료를 이용한 부품 가공과 조립 및 꾸미기로 모형주택을 잘 만들었음."},{"$nulls":3},{"$f":"IF(G91=\"\",\"\",LEN(G91))","v":256}]
[{"$nulls":4},{"$f":"IF(VLOOKUP(C91,평가결과_자율,4,FALSE)=\"\",\"\",IF(메인!$J$8>=2,메인!$F$19,\"\"))","v":"전통 한옥 목재 맞춤 제작"},{"$f":"IF(VLOOKUP(C91,평가결과_자율,4,FALSE)=\"\",\"\",VLOOKUP(C91,평가결과_자율,4,FALSE))","v":"C"}]
[{"$nulls":4},{"$f":"IF(VLOOKUP(C91,평가결과_자율,5,FALSE)=\"\",\"\",IF(메인!$J$8>=3,메인!$F$20,\"\"))","v":"창의적 계단 모형 만들기"},{"$f":"IF(VLOOKUP(C91,평가결과_자율,5,FALSE)=\"\",\"\",VLOOKUP(C91,평가결과_자율,5,FALSE))","v":"B"}]
[{"$nulls":4},{"$f":"IF(VLOOKUP(C91,평가결과_자율,6,FALSE)=\"\",\"\",IF(메인!$J$8>=4,메인!$F$21,\"\"))","v":"창의적 모형주택 만들기"},{"$f":"IF(VLOOKUP(C91,평가결과_자율,6,FALSE)=\"\",\"\",VLOOKUP(C91,평가결과_자율,6,FALSE))","v":"A"}]
[{"$nulls":4},{"$f":"IF(VLOOKUP(C91,평가결과_자율,7,FALSE)=\"\",\"\",IF(메인!$J$8>=5,메인!$F$22,\"\"))","v":"창의적 교량 만들기"},{"$f":"IF(VLOOKUP(C91,평가결과_자율,7,FALSE)=\"\",\"\",VLOOKUP(C91,평가결과_자율,7,FALSE))","v":"A"}]
[{"$nulls":4},{"$f":"IF(VLOOKUP(C91,평가결과_자율,8,FALSE)=\"\",\"\",IF(메인!$J$8>=6,메인!$F$23,\"\"))","v":""},{"$f":"IF(VLOOKUP(C91,평가결과_자율,8,FALSE)=\"\",\"\",VLOOKUP(C91,평가결과_자율,8,FALSE))","v":""}]
[{"$nulls":4},{"$f":"IF(VLOOKUP(C91,평가결과_자율,9,FALSE)=\"\",\"\",IF(메인!$J$8>=7,메인!$F$24,\"\"))","v":""},{"$f":"IF(VLOOKUP(C91,평가결과_자율,9,FALSE)=\"\",\"\",VLOOKUP(C91,평가결과_자율,9,FALSE))","v":""}]
[null,null,14,{"$f":"IF(VLOOKUP(C98,학적,2,FALSE)=\"\",\"\",VLOOKUP(C98,학적,2,FALSE))","v":"학생14"},{"$f":"IF(VLOOKUP(C98,평가결과_자율,3,FALSE)=\"\",\"\",IF(메인!$J$8>=1,메인!$F$18,\"\"))","v":""},{"$f":"IF(VLOOKUP(C98,평가결과_자율,3,FALSE)=\"\",\"\",VLOOKUP(C98,평가결과_자율,3,FALSE))","v":""},{"$f":"IF(OR(D98=\"\",COUNTBLANK(F98:F104)=7),\"\",VLOOKUP(D98,평가_자유!$D$7:$X$46,20,FALSE))","v":""},{"$nulls":3},{"$f":"IF(G98=\"\",\"\",LEN(G98))","v":""}]
[{"$nulls":4},{"$f":"IF(VLOOKUP(C98,평가결과_자율,4,FALSE)=\"\",\"\",IF(메인!$J$8>=2,메인!$F$19,\"\"))","v":""},{"$f":"IF(VLOOKUP(C98,평가결과_자율,4,FALSE)=\"\",\"\",VLOOKUP(C98,평가결과_자율,4,FALSE))","v":""}]
[{"$nulls":4},{"$f":"IF(VLOOKUP(C98,평가결과_자율,5,FALSE)=\"\",\"\",IF(메인!$J$8>=3,메인!$F$20,\"\"))","v":""},{"$f":"IF(VLOOKUP(C98,평가결과_자율,5,FALSE)=\"\",\"\",VLOOKUP(C98,평가결과_자율,5,FALSE))","v":""}]
[{"$nulls":4},{"$f":"IF(VLOOKUP(C98,평가결과_자율,6,FALSE)=\"\",\"\",IF(메인!$J$8>=4,메인!$F$21,\"\"))","v":""},{"$f":"IF(VLOOKUP(C98,평가결과_자율,6,FALSE)=\"\",\"\",VLOOKUP(C98,평가결과_자율,6,FALSE))","v":""}]
[{"$nulls":4},{"$f":"IF(VLOOKUP(C98,평가결과_자율,7,FALSE)=\"\",\"\",IF(메인!$J$8>=5,메인!$F$22,\"\"))","v":""},{"$f":"IF(VLOOKUP(C98,평가결과_자율,7,FALSE)=\"\",\"\",VLOOKUP(C98,평가결과_자율,7,FALSE))","v":""}]
[{"$nulls":4},{"$f":"IF(VLOOKUP(C98,평가결과_자율,8,FALSE)=\"\",\"\",IF(메인!$J$8>=6,메인!$F$23,\"\"))","v":""},{"$f":"IF(VLOOKUP(C98,평가결과_자율,8,FALSE)=\"\",\"\",VLOOKUP(C98,평가결과_자율,8,FALSE))","v":""}]
[{"$nulls":4},{"$f":"IF(VLOOKUP(C98,평가결과_자율,9,FALSE)=\"\",\"\",IF(메인!$J$8>=7,메인!$F$24,\"\"))","v":""},{"$f":"IF(VLOOKUP(C98,평가결과_자율,9,FALSE)=\"\",\"\",VLOOKUP(C98,평가결과_자율,9,FALSE))","v":""}]
[null,null,15,{"$f":"IF(VLOOKUP(C105,학적,2,FALSE)=\"\",\"\",VLOOKUP(C105,학적,2,FALSE))","v":"학생15"},{"$f":"IF(VLOOKUP(C105,평가결과_자율,3,FALSE)=\"\",\"\",IF(메인!$J$8>=1,메인!$F$18,\"\"))","v":""},{"$f":"IF(VLOOKUP(C105,평가결과_자율,3,FALSE)=\"\",\"\",VLOOKUP(C105,평가결과_자율,3,FALSE))","v":""},{"$f":"IF(OR(D105=\"\",COUNTBLANK(F105:F111)=7),\"\",VLOOKUP(D105,평가_자유!$D$7:$X$46,20,FALSE))","v":""},{"$nulls":3},{"$f":"IF(G105=\"\",\"\",LEN(G105))","v":""}]
[{"$nulls":4},{"$f":"IF(VLOOKUP(C105,평가결과_자율,4,FALSE)=\"\",\"\",IF(메인!$J$8>=2,메인!$F$19,\"\"))","v":""},{"$f":"IF(VLOOKUP(C105,평가결과_자율,4,FALSE)=\"\",\"\",VLOOKUP(C105,평가결과_자율,4,FALSE))","v":""}]
[{"$nulls":4},{"$f":"IF(VLOOKUP(C105,평가결과_자율,5,FALSE)=\"\",\"\",IF(메인!$J$8>=3,메인!$F$20,\"\"))","v":""},{"$f":"IF(VLOOKUP(C105,평가결과_자율,5,FALSE)=\"\",\"\",VLOOKUP(C105,평가결과_자율,5,FALSE))","v":""}]
[{"$nulls":4},{"$f":"IF(VLOOKUP(C105,평가결과_자율,6,FALSE)=\"\",\"\",IF(메인!$J$8>=4,메인!$F$21,\"\"))","v":""},{"$f":"IF(VLOOKUP(C105,평가결과_자율,6,FALSE)=\"\",\"\",VLOOKUP(C105,평가결과_자율,6,FALSE))","v":""}]
[{"$nulls":4},{"$f":"IF(VLOOKUP(C105,평가결과_자율,7,FALSE)=\"\",\"\",IF(메인!$J$8>=5,메인!$F$22,\"\"))","v":""},{"$f":"IF(VLOOKUP(C105,평가결과_자율,7,FALSE)=\"\",\"\",VLOOKUP(C105,평가결과_자율,7,FALSE))","v":""}]
[{"$nulls":4},{"$f":"IF(VLOOKUP(C105,평가결과_자율,8,FALSE)=\"\",\"\",IF(메인!$J$8>=6,메인!$F$23,\"\"))","v":""},{"$f":"IF(VLOOKUP(C105,평가결과_자율,8,FALSE)=\"\",\"\",VLOOKUP(C105,평가결과_자율,8,FALSE))","v":""}]
[{"$nulls":4},{"$f":"IF(VLOOKUP(C105,평가결과_자율,9,FALSE)=\"\",\"\",IF(메인!$J$8>=7,메인!$F$24,\"\"))","v":""},{"$f":"IF(VLOOKUP(C105,평가결과_자율,9,FALSE)=\"\",\"\",VLOOKUP(C105,평가결과_자율,9,FALSE))","v":""}]
[null,null,16,{"$f":"IF(VLOOKUP(C112,학적,2,FALSE)=\"\",\"\",VLOOKUP(C112,학적,2,FALSE))","v":"학생16"},{"$f":"IF(VLOOKUP(C112,평가결과_자율,3,FALSE)=\"\",\"\",IF(메인!$J$8>=1,메인!$F$18,\"\"))","v":"재료의 가공"},{"$f":"IF(VLOOKUP(C112,평가결과_자율,3,FALSE)=\"\",\"\",VLOOKUP(C112,평가결과_자율,3,FALSE))","v":"B"},{"$f":"IF(OR(D112=\"\",COUNTBLANK(F112:F118)=7),\"\",VLOOKUP(D112,평가_자유!$D$7:$X$46,20,FALSE))","v":"안전 수칙을 준수하였으나 도구를 이용한 각종 재료(하드보드지, 우드락, 폼보드, 목재)의 자르기에서 일부 재료는 원하는 치수와 모양대로 처리함이 다소 부족하였음. 한옥의 짜맞춤 구조물 부품의 제작과 조립이 양호하여 일반적인 작품으로서의 완성을 하였음. 실내외 통로 구조물로서 입체적인 계단의 구성 및 벽면과의 배치가 매우 잘 되었음. 4인 가족의 주거공간 구상과 설계가 부족한 상태에서 주어진 재료를 이용한 주택 구상과 설계가 미흡하고 부품 가공과 조립 및 꾸미기 작업이 대체로 서툴렀음."},{"$nulls":3},{"$f":"IF(G112=\"\",\"\",LEN(G112))","v":273}]
[{"$nulls":4},{"$f":"IF(VLOOKUP(C112,평가결과_자율,4,FALSE)=\"\",\"\",IF(메인!$J$8>=2,메인!$F$19,\"\"))","v":"전통 한옥 목재 맞춤 제작"},{"$f":"IF(VLOOKUP(C112,평가결과_자율,4,FALSE)=\"\",\"\",VLOOKUP(C112,평가결과_자율,4,FALSE))","v":"B"}]
[{"$nulls":4},{"$f":"IF(VLOOKUP(C112,평가결과_자율,5,FALSE)=\"\",\"\",IF(메인!$J$8>=3,메인!$F$20,\"\"))","v":"창의적 계단 모형 만들기"},{"$f":"IF(VLOOKUP(C112,평가결과_자율,5,FALSE)=\"\",\"\",VLOOKUP(C112,평가결과_자율,5,FALSE))","v":"A"}]
[{"$nulls":4},{"$f":"IF(VLOOKUP(C112,평가결과_자율,6,FALSE)=\"\",\"\",IF(메인!$J$8>=4,메인!$F$21,\"\"))","v":"창의적 모형주택 만들기"},{"$f":"IF(VLOOKUP(C112,평가결과_자율,6,FALSE)=\"\",\"\",VLOOKUP(C112,평가결과_자율,6,FALSE))","v":"C"}]
[{"$nulls":4},{"$f":"IF(VLOOKUP(C112,평가결과_자율,7,FALSE)=\"\",\"\",IF(메인!$J$8>=5,메인!$F$22,\"\"))","v":"창의적 교량 만들기"},{"$f":"IF(VLOOKUP(C112,평가결과_자율,7,FALSE)=\"\",\"\",VLOOKUP(C112,평가결과_자율,7,FALSE))","v":"전출"}]
[{"$nulls":4},{"$f":"IF(VLOOKUP(C112,평가결과_자율,8,FALSE)=\"\",\"\",IF(메인!$J$8>=6,메인!$F$23,\"\"))","v":""},{"$f":"IF(VLOOKUP(C112,평가결과_자율,8,FALSE)=\"\",\"\",VLOOKUP(C112,평가결과_자율,8,FALSE))","v":""}]
[{"$nulls":4},{"$f":"IF(VLOOKUP(C112,평가결과_자율,9,FALSE)=\"\",\"\",IF(메인!$J$8>=7,메인!$F$24,\"\"))","v":""},{"$f":"IF(VLOOKUP(C112,평가결과_자율,9,FALSE)=\"\",\"\",VLOOKUP(C112,평가결과_자율,9,FALSE))","v":""}]
[null,null,17,{"$f":"IF(VLOOKUP(C119,학적,2,FALSE)=\"\",\"\",VLOOKUP(C119,학적,2,FALSE))","v":"학생17"},{"$f":"IF(VLOOKUP(C119,평가결과_자율,3,FALSE)=\"\",\"\",IF(메인!$J$8>=1,메인!$F$18,\"\"))","v":"재료의 가공"},{"$f":"IF(VLOOKUP(C119,평가결과_자율,3,FALSE)=\"\",\"\",VLOOKUP(C119,평가결과_자율,3,FALSE))","v":"C"},{"$f":"IF(OR(D119=\"\",COUNTBLANK(F119:F125)=7),\"\",VLOOKUP(D119,평가_자유!$D$7:$X$46,20,FALSE))","v":"안전 수칙이 잘 지켜지지 않고 도구를 이용한 각종 재료(하드보드지, 우드락, 폼보드, 목재)의 자르기를 원하는 치수와 모양대로 하는데 어려움을 겪었음. 한옥의 짜맞춤 구조물 부품의 제작과 조립이 양호하여 일반적인 작품으로서의 완성을 하였음. 실내외 통로 구조물로서 계단의 구성 및 벽면과의 배치가 잘 이루어지지 않았음. 4인 가족의 주거공간 구상과 설계가 평범한 상태에서 주어진 재료를 이용한 주택 구상과 설계는 다소 미흡하나 가공 및 조립과 꾸미기로 모형주택을 적당하게 만들었음."},{"$nulls":3},{"$f":"IF(G119=\"\",\"\",LEN(G119))","v":269}]
[{"$nulls":4},{"$f":"IF(VLOOKUP(C119,평가결과_자율,4,FALSE)=\"\",\"\",IF(메인!$J$8>=2,메인!$F$19,\"\"))","v":"전통 한옥 목재 맞춤 제작"},{"$f":"IF(VLOOKUP(C119,평가결과_자율,4,FALSE)=\"\",\"\",VLOOKUP(C119,평가결과_자율,4,FALSE))","v":"B"}]
[{"$nulls":4},{"$f":"IF(VLOOKUP(C119,평가결과_자율,5,FALSE)=\"\",\"\",IF(메인!$J$8>=3,메인!$F$20,\"\"))","v":"창의적 계단 모형 만들기"},{"$f":"IF(VLOOKUP(C119,평가결과_자율,5,FALSE)=\"\",\"\",VLOOKUP(C119,평가결과_자율,5,FALSE))","v":"C"}]
[{"$nulls":4},{"$f":"IF(VLOOKUP(C119,평가결과_자율,6,FALSE)=\"\",\"\",IF(메인!$J$8>=4,메인!$F$21,\"\"))","v":"창의적 모형주택 만들기"},{"$f":"IF(VLOOKUP(C119,평가결과_자율,6,FALSE)=\"\",\"\",VLOOKUP(C119,평가결과_자율,6,FALSE))","v":"B"}]
[{"$nulls":4},{"$f":"IF(VLOOKUP(C119,평가결과_자율,7,FALSE)=\"\",\"\",IF(메인!$J$8>=5,메인!$F$22,\"\"))","v":"창의적 교량 만들기"},{"$f":"IF(VLOOKUP(C119,평가결과_자율,7,FALSE)=\"\",\"\",VLOOKUP(C119,평가결과_자율,7,FALSE))","v":"A"}]
[{"$nulls":4},{"$f":"IF(VLOOKUP(C119,평가결과_자율,8,FALSE)=\"\",\"\",IF(메인!$J$8>=6,메인!$F$23,\"\"))","v":""},{"$f":"IF(VLOOKUP(C119,평가결과_자율,8,FALSE)=\"\",\"\",VLOOKUP(C119,평가결과_자율,8,FALSE))","v":""}]
[{"$nulls":4},{"$f":"IF(VLOOKUP(C119,평가결과_자율,9,FALSE)=\"\",\"\",IF(메인!$J$8>=7,메인!$F$24,\"\"))","v":""},{"$f":"IF(VLOOKUP(C119,평가결과_자율,9,FALSE)=\"\",\"\",VLOOKUP(C119,평가결과_자율,9,FALSE))","v":""}]
[null,null,18,{"$f":"IF(VLOOKUP(C126,학적,2,FALSE)=\"\",\"\",VLOOKUP(C126,학적,2,FALSE))","v":"학생18"},{"$f":"IF(VLOOKUP(C126,평가결과_자율,3,FALSE)=\"\",\"\",IF(메인!$J$8>=1,메인!$F$18,\"\"))","v":"재료의 가공"},{"$f":"IF(VLOOKUP(C126,평가결과_자율,3,FALSE)=\"\",\"\",VLOOKUP(C126,평가결과_자율,3,FALSE))","v":"A"},{"$f":"IF(OR(D126=\"\",COUNTBLANK(F126:F132)=7),\"\",VLOOKUP(D126,평가_자유!$D$7:$X$46,20,FALSE))","v":"안전 수칙을 준수하며 도구를 이용한 각종 재료(하드보드지, 우드락, 폼보드, 목재)의 자르기를 원하는 치수와 모양대로 안정감 있게 잘 하였음. 한옥의 짜맞춤 구조물 만들기에서 부품의 제작이 정확하고 조립이 견고하여 완성도가 높음. 실내외 통로 구조물로서 입체적인 계단의 구성 및 벽면과의 배치가 매우 잘 되었음. 4인 가족의 주거공간 구상과 설계가 평범한 상태에서 주어진 재료를 이용한 주택 구상과 설계는 다소 미흡하나 가공 및 조립과 꾸미기로 모형주택을 적당하게 만들었음."},{"$nulls":3},{"$f":"IF(G126=\"\",\"\",LEN(G126))","v":265}]
[{"$nulls":4},{"$f":"IF(VLOOKUP(C126,평가결과_자율,4,FALSE)=\"\",\"\",IF(메인!$J$8>=2,메인!$F$19,\"\"))","v":"전통 한옥 목재 맞춤 제작"},{"$f":"IF(VLOOKUP(C126,평가결과_자율,4,FALSE)=\"\",\"\",VLOOKUP(C126,평가결과_자율,4,FALSE))","v":"A"}]
[{"$nulls":4},{"$f":"IF(VLOOKUP(C126,평가결과_자율,5,FALSE)=\"\",\"\",IF(메인!$J$8>=3,메인!$F$20,\"\"))","v":"창의적 계단 모형 만들기"},{"$f":"IF(VLOOKUP(C126,평가결과_자율,5,FALSE)=\"\",\"\",VLOOKUP(C126,평가결과_자율,5,FALSE))","v":"A"}]
[{"$nulls":4},{"$f":"IF(VLOOKUP(C126,평가결과_자율,6,FALSE)=\"\",\"\",IF(메인!$J$8>=4,메인!$F$21,\"\"))","v":"창의적 모형주택 만들기"},{"$f":"IF(VLOOKUP(C126,평가결과_자율,6,FALSE)=\"\",\"\",VLOOKUP(C126,평가결과_자율,6,FALSE))","v":"B"}]
[{"$nulls":4},{"$f":"IF(VLOOKUP(C126,평가결과_자율,7,FALSE)=\"\",\"\",IF(메인!$J$8>=5,메인!$F$22,\"\"))","v":"창의적 교량 만들기"},{"$f":"IF(VLOOKUP(C126,평가결과_자율,7,FALSE)=\"\",\"\",VLOOKUP(C126,평가결과_자율,7,FALSE))","v":"B"}]
[{"$nulls":4},{"$f":"IF(VLOOKUP(C126,평가결과_자율,8,FALSE)=\"\",\"\",IF(메인!$J$8>=6,메인!$F$23,\"\"))","v":""},{"$f":"IF(VLOOKUP(C126,평가결과_자율,8,FALSE)=\"\",\"\",VLOOKUP(C126,평가결과_자율,8,FALSE))","v":""}]
[{"$nulls":4},{"$f":"IF(VLOOKUP(C126,평가결과_자율,9,FALSE)=\"\",\"\",IF(메인!$J$8>=7,메인!$F$24,\"\"))","v":""},{"$f":"IF(VLOOKUP(C126,평가결과_자율,9,FALSE)=\"\",\"\",VLOOKUP(C126,평가결과_자율,9,FALSE))","v":""}]
[null,null,19,{"$f":"IF(VLOOKUP(C133,학적,2,FALSE)=\"\",\"\",VLOOKUP(C133,학적,2,FALSE))","v":"학생19"},{"$f":"IF(VLOOKUP(C133,평가결과_자율,3,FALSE)=\"\",\"\",IF(메인!$J$8>=1,메인!$F$18,\"\"))","v":""},{"$f":"IF(VLOOKUP(C133,평가결과_자율,3,FALSE)=\"\",\"\",VLOOKUP(C133,평가결과_자율,3,FALSE))","v":""},{"$f":"IF(OR(D133=\"\",COUNTBLANK(F133:F139)=7),\"\",VLOOKUP(D133,평가_자유!$D$7:$X$46,20,FALSE))","v":""},{"$nulls":3},{"$f":"IF(G133=\"\",\"\",LEN(G133))","v":""}]
[{"$nulls":4},{"$f":"IF(VLOOKUP(C133,평가결과_자율,4,FALSE)=\"\",\"\",IF(메인!$J$8>=2,메인!$F$19,\"\"))","v":""},{"$f":"IF(VLOOKUP(C133,평가결과_자율,4,FALSE)=\"\",\"\",VLOOKUP(C133,평가결과_자율,4,FALSE))","v":""}]
[{"$nulls":4},{"$f":"IF(VLOOKUP(C133,평가결과_자율,5,FALSE)=\"\",\"\",IF(메인!$J$8>=3,메인!$F$20,\"\"))","v":""},{"$f":"IF(VLOOKUP(C133,평가결과_자율,5,FALSE)=\"\",\"\",VLOOKUP(C133,평가결과_자율,5,FALSE))","v":""}]
[{"$nulls":4},{"$f":"IF(VLOOKUP(C133,평가결과_자율,6,FALSE)=\"\",\"\",IF(메인!$J$8>=4,메인!$F$21,\"\"))","v":""},{"$f":"IF(VLOOKUP(C133,평가결과_자율,6,FALSE)=\"\",\"\",VLOOKUP(C133,평가결과_자율,6,FALSE))","v":""}]
[{"$nulls":4},{"$f":"IF(VLOOKUP(C133,평가결과_자율,7,FALSE)=\"\",\"\",IF(메인!$J$8>=5,메인!$F$22,\"\"))","v":""},{"$f":"IF(VLOOKUP(C133,평가결과_자율,7,FALSE)=\"\",\"\",VLOOKUP(C133,평가결과_자율,7,FALSE))","v":""}]
[{"$nulls":4},{"$f":"IF(VLOOKUP(C133,평가결과_자율,8,FALSE)=\"\",\"\",IF(메인!$J$8>=6,메인!$F$23,\"\"))","v":""},{"$f":"IF(VLOOKUP(C133,평가결과_자율,8,FALSE)=\"\",\"\",VLOOKUP(C133,평가결과_자율,8,FALSE))","v":""}]
[{"$nulls":4},{"$f":"IF(VLOOKUP(C133,평가결과_자율,9,FALSE)=\"\",\"\",IF(메인!$J$8>=7,메인!$F$24,\"\"))","v":""},{"$f":"IF(VLOOKUP(C133,평가결과_자율,9,FALSE)=\"\",\"\",VLOOKUP(C133,평가결과_자율,9,FALSE))","v":""}]
[null,null,20,{"$f":"IF(VLOOKUP(C140,학적,2,FALSE)=\"\",\"\",VLOOKUP(C140,학적,2,FALSE))","v":"학생20"},{"$f":"IF(VLOOKUP(C140,평가결과_자율,3,FALSE)=\"\",\"\",IF(메인!$J$8>=1,메인!$F$18,\"\"))","v":""},{"$f":"IF(VLOOKUP(C140,평가결과_자율,3,FALSE)=\"\",\"\",VLOOKUP(C140,평가결과_자율,3,FALSE))","v":""},{"$f":"IF(OR(D140=\"\",COUNTBLANK(F140:F146)=7),\"\",VLOOKUP(D140,평가_자유!$D$7:$X$46,20,FALSE))","v":""},{"$nulls":3},{"$f":"IF(G140=\"\",\"\",LEN(G140))","v":""}]
[{"$nulls":4},{"$f":"IF(VLOOKUP(C140,평가결과_자율,4,FALSE)=\"\",\"\",IF(메인!$J$8>=2,메인!$F$19,\"\"))","v":""},{"$f":"IF(VLOOKUP(C140,평가결과_자율,4,FALSE)=\"\",\"\",VLOOKUP(C140,평가결과_자율,4,FALSE))","v":""}]
[{"$nulls":4},{"$f":"IF(VLOOKUP(C140,평가결과_자율,5,FALSE)=\"\",\"\",IF(메인!$J$8>=3,메인!$F$20,\"\"))","v":""},{"$f":"IF(VLOOKUP(C140,평가결과_자율,5,FALSE)=\"\",\"\",VLOOKUP(C140,평가결과_자율,5,FALSE))","v":""}]
[{"$nulls":4},{"$f":"IF(VLOOKUP(C140,평가결과_자율,6,FALSE)=\"\",\"\",IF(메인!$J$8>=4,메인!$F$21,\"\"))","v":""},{"$f":"IF(VLOOKUP(C140,평가결과_자율,6,FALSE)=\"\",\"\",VLOOKUP(C140,평가결과_자율,6,FALSE))","v":""}]
[{"$nulls":4},{"$f":"IF(VLOOKUP(C140,평가결과_자율,7,FALSE)=\"\",\"\",IF(메인!$J$8>=5,메인!$F$22,\"\"))","v":""},{"$f":"IF(VLOOKUP(C140,평가결과_자율,7,FALSE)=\"\",\"\",VLOOKUP(C140,평가결과_자율,7,FALSE))","v":""}]
[{"$nulls":4},{"$f":"IF(VLOOKUP(C140,평가결과_자율,8,FALSE)=\"\",\"\",IF(메인!$J$8>=6,메인!$F$23,\"\"))","v":""},{"$f":"IF(VLOOKUP(C140,평가결과_자율,8,FALSE)=\"\",\"\",VLOOKUP(C140,평가결과_자율,8,FALSE))","v":""}]
[{"$nulls":4},{"$f":"IF(VLOOKUP(C140,평가결과_자율,9,FALSE)=\"\",\"\",IF(메인!$J$8>=7,메인!$F$24,\"\"))","v":""},{"$f":"IF(VLOOKUP(C140,평가결과_자율,9,FALSE)=\"\",\"\",VLOOKUP(C140,평가결과_자율,9,FALSE))","v":""}]
[null,null,21,{"$f":"IF(VLOOKUP(C147,학적,2,FALSE)=\"\",\"\",VLOOKUP(C147,학적,2,FALSE))","v":"학생21"},{"$f":"IF(VLOOKUP(C147,평가결과_자율,3,FALSE)=\"\",\"\",IF(메인!$J$8>=1,메인!$F$18,\"\"))","v":"재료의 가공"},{"$f":"IF(VLOOKUP(C147,평가결과_자율,3,FALSE)=\"\",\"\",VLOOKUP(C147,평가결과_자율,3,FALSE))","v":"A"},{"$f":"IF(OR(D147=\"\",COUNTBLANK(F147:F153)=7),\"\",VLOOKUP(D147,평가_자유!$D$7:$X$46,20,FALSE))","v":"안전 수칙을 준수하며 도구를 이용한 각종 재료(하드보드지, 우드락, 폼보드, 목재)의 자르기를 원하는 치수와 모양대로 안정감 있게 잘 하였음. 한옥의 짜맞춤 구조물 부품의 제작과 조립이 양호하여 일반적인 작품으로서의 완성을 하였음. 실내외 통로 구조물로서 단순한 계단의 구성 및 벽면과의 배치가 양호한 편임. 4인 가족의 주거공간 구상과 설계가 부족한 상태에서 주어진 재료를 이용한 주택 구상과 설계가 미흡하고 부품 가공과 조립 및 꾸미기 작업이 대체로 서툴렀음."},{"$nulls":3},{"$f":"IF(G147=\"\",\"\",LEN(G147))","v":259}]
[{"$nulls":4},{"$f":"IF(VLOOKUP(C147,평가결과_자율,4,FALSE)=\"\",\"\",IF(메인!$J$8>=2,메인!$F$19,\"\"))","v":"전통 한옥 목재 맞춤 제작"},{"$f":"IF(VLOOKUP(C147,평가결과_자율,4,FALSE)=\"\",\"\",VLOOKUP(C147,평가결과_자율,4,FALSE))","v":"B"}]
[{"$nulls":4},{"$f":"IF(VLOOKUP(C147,평가결과_자율,5,FALSE)=\"\",\"\",IF(메인!$J$8>=3,메인!$F$20,\"\"))","v":"창의적 계단 모형 만들기"},{"$f":"IF(VLOOKUP(C147,평가결과_자율,5,FALSE)=\"\",\"\",VLOOKUP(C147,평가결과_자율,5,FALSE))","v":"B"}]
[{"$nulls":4},{"$f":"IF(VLOOKUP(C147,평가결과_자율,6,FALSE)=\"\",\"\",IF(메인!$J$8>=4,메인!$F$21,\"\"))","v":"창의적 모형주택 만들기"},{"$f":"IF(VLOOKUP(C147,평가결과_자율,6,FALSE)=\"\",\"\",VLOOKUP(C147,평가결과_자율,6,FALSE))","v":"C"}]
[{"$nulls":4},{"$f":"IF(VLOOKUP(C147,평가결과_자율,7,FALSE)=\"\",\"\",IF(메인!$J$8>=5,메인!$F$22,\"\"))","v":"창의적 교량 만들기"},{"$f":"IF(VLOOKUP(C147,평가결과_자율,7,FALSE)=\"\",\"\",VLOOKUP(C147,평가결과_자율,7,FALSE))","v":"B"}]
[{"$nulls":4},{"$f":"IF(VLOOKUP(C147,평가결과_자율,8,FALSE)=\"\",\"\",IF(메인!$J$8>=6,메인!$F$23,\"\"))","v":""},{"$f":"IF(VLOOKUP(C147,평가결과_자율,8,FALSE)=\"\",\"\",VLOOKUP(C147,평가결과_자율,8,FALSE))","v":""}]
[{"$nulls":4},{"$f":"IF(VLOOKUP(C147,평가결과_자율,9,FALSE)=\"\",\"\",IF(메인!$J$8>=7,메인!$F$24,\"\"))","v":""},{"$f":"IF(VLOOKUP(C147,평가결과_자율,9,FALSE)=\"\",\"\",VLOOKUP(C147,평가결과_자율,9,FALSE))","v":""}]
[null,null,22,{"$f":"IF(VLOOKUP(C154,학적,2,FALSE)=\"\",\"\",VLOOKUP(C154,학적,2,FALSE))","v":"학생22"},{"$f":"IF(VLOOKUP(C154,평가결과_자율,3,FALSE)=\"\",\"\",IF(메인!$J$8>=1,메인!$F$18,\"\"))","v":""},{"$f":"IF(VLOOKUP(C154,평가결과_자율,3,FALSE)=\"\",\"\",VLOOKUP(C154,평가결과_자율,3,FALSE))","v":""},{"$f":"IF(OR(D154=\"\",COUNTBLANK(F154:F160)=7),\"\",VLOOKUP(D154,평가_자유!$D$7:$X$46,20,FALSE))","v":""},{"$nulls":3},{"$f":"IF(G154=\"\",\"\",LEN(G154))","v":""}]
[{"$nulls":4},{"$f":"IF(VLOOKUP(C154,평가결과_자율,4,FALSE)=\"\",\"\",IF(메인!$J$8>=2,메인!$F$19,\"\"))","v":""},{"$f":"IF(VLOOKUP(C154,평가결과_자율,4,FALSE)=\"\",\"\",VLOOKUP(C154,평가결과_자율,4,FALSE))","v":""}]
[{"$nulls":4},{"$f":"IF(VLOOKUP(C154,평가결과_자율,5,FALSE)=\"\",\"\",IF(메인!$J$8>=3,메인!$F$20,\"\"))","v":""},{"$f":"IF(VLOOKUP(C154,평가결과_자율,5,FALSE)=\"\",\"\",VLOOKUP(C154,평가결과_자율,5,FALSE))","v":""}]
[{"$nulls":4},{"$f":"IF(VLOOKUP(C154,평가결과_자율,6,FALSE)=\"\",\"\",IF(메인!$J$8>=4,메인!$F$21,\"\"))","v":""},{"$f":"IF(VLOOKUP(C154,평가결과_자율,6,FALSE)=\"\",\"\",VLOOKUP(C154,평가결과_자율,6,FALSE))","v":""}]
[{"$nulls":4},{"$f":"IF(VLOOKUP(C154,평가결과_자율,7,FALSE)=\"\",\"\",IF(메인!$J$8>=5,메인!$F$22,\"\"))","v":""},{"$f":"IF(VLOOKUP(C154,평가결과_자율,7,FALSE)=\"\",\"\",VLOOKUP(C154,평가결과_자율,7,FALSE))","v":""}]
[{"$nulls":4},{"$f":"IF(VLOOKUP(C154,평가결과_자율,8,FALSE)=\"\",\"\",IF(메인!$J$8>=6,메인!$F$23,\"\"))","v":""},{"$f":"IF(VLOOKUP(C154,평가결과_자율,8,FALSE)=\"\",\"\",VLOOKUP(C154,평가결과_자율,8,FALSE))","v":""}]
[{"$nulls":4},{"$f":"IF(VLOOKUP(C154,평가결과_자율,9,FALSE)=\"\",\"\",IF(메인!$J$8>=7,메인!$F$24,\"\"))","v":""},{"$f":"IF(VLOOKUP(C154,평가결과_자율,9,FALSE)=\"\",\"\",VLOOKUP(C154,평가결과_자율,9,FALSE))","v":""}]
[null,null,23,{"$f":"IF(VLOOKUP(C161,학적,2,FALSE)=\"\",\"\",VLOOKUP(C161,학적,2,FALSE))","v":"학생23"},{"$f":"IF(VLOOKUP(C161,평가결과_자율,3,FALSE)=\"\",\"\",IF(메인!$J$8>=1,메인!$F$18,\"\"))","v":"재료의 가공"},{"$f":"IF(VLOOKUP(C161,평가결과_자율,3,FALSE)=\"\",\"\",VLOOKUP(C161,평가결과_자율,3,FALSE))","v":"C"},{"$f":"IF(OR(D161=\"\",COUNTBLANK(F161:F167)=7),\"\",VLOOKUP(D161,평가_자유!$D$7:$X$46,20,FALSE))","v":"안전 수칙이 잘 지켜지지 않고 도구를 이용한 각종 재료(하드보드지, 우드락, 폼보드, 목재)의 자르기를 원하는 치수와 모양대로 하는데 어려움을 겪었음. 한옥의 짜맞춤 구조물 부품의 제작과 조립이 양호하여 일반적인 작품으로서의 완성을 하였음. 실내외 통로 구조물로서 계단의 구성 및 벽면과의 배치가 잘 이루어지지 않았음. 4인 가족의 주거공간 구상과 설계가 부족한 상태에서 주어진 재료를 이용한 주택 구상과 설계가 미흡하고 부품 가공과 조립 및 꾸미기 작업이 대체로 서툴렀음."},{"$nulls":3},{"$f":"IF(G161=\"\",\"\",LEN(G161))","v":265}]
[{"$nulls":4},{"$f":"IF(VLOOKUP(C161,평가결과_자율,4,FALSE)=\"\",\"\",IF(메인!$J$8>=2,메인!$F$19,\"\"))","v":"전통 한옥 목재 맞춤 제작"},{"$f":"IF(VLOOKUP(C161,평가결과_자율,4,FALSE)=\"\",\"\",VLOOKUP(C161,평가결과_자율,4,FALSE))","v":"B"}]
[{"$nulls":4},{"$f":"IF(VLOOKUP(C161,평가결과_자율,5,FALSE)=\"\",\"\",IF(메인!$J$8>=3,메인!$F$20,\"\"))","v":"창의적 계단 모형 만들기"},{"$f":"IF(VLOOKUP(C161,평가결과_자율,5,FALSE)=\"\",\"\",VLOOKUP(C161,평가결과_자율,5,FALSE))","v":"C"}]
[{"$nulls":4},{"$f":"IF(VLOOKUP(C161,평가결과_자율,6,FALSE)=\"\",\"\",IF(메인!$J$8>=4,메인!$F$21,\"\"))","v":"창의적 모형주택 만들기"},{"$f":"IF(VLOOKUP(C161,평가결과_자율,6,FALSE)=\"\",\"\",VLOOKUP(C161,평가결과_자율,6,FALSE))","v":"C"}]
[{"$nulls":4},{"$f":"IF(VLOOKUP(C161,평가결과_자율,7,FALSE)=\"\",\"\",IF(메인!$J$8>=5,메인!$F$22,\"\"))","v":"창의적 교량 만들기"},{"$f":"IF(VLOOKUP(C161,평가결과_자율,7,FALSE)=\"\",\"\",VLOOKUP(C161,평가결과_자율,7,FALSE))","v":"B"}]
[{"$nulls":4},{"$f":"IF(VLOOKUP(C161,평가결과_자율,8,FALSE)=\"\",\"\",IF(메인!$J$8>=6,메인!$F$23,\"\"))","v":""},{"$f":"IF(VLOOKUP(C161,평가결과_자율,8,FALSE)=\"\",\"\",VLOOKUP(C161,평가결과_자율,8,FALSE))","v":""}]
[{"$nulls":4},{"$f":"IF(VLOOKUP(C161,평가결과_자율,9,FALSE)=\"\",\"\",IF(메인!$J$8>=7,메인!$F$24,\"\"))","v":""},{"$f":"IF(VLOOKUP(C161,평가결과_자율,9,FALSE)=\"\",\"\",VLOOKUP(C161,평가결과_자율,9,FALSE))","v":""}]
[null,null,24,{"$f":"IF(VLOOKUP(C168,학적,2,FALSE)=\"\",\"\",VLOOKUP(C168,학적,2,FALSE))","v":"학생24"},{"$f":"IF(VLOOKUP(C168,평가결과_자율,3,FALSE)=\"\",\"\",IF(메인!$J$8>=1,메인!$F$18,\"\"))","v":""},{"$f":"IF(VLOOKUP(C168,평가결과_자율,3,FALSE)=\"\",\"\",VLOOKUP(C168,평가결과_자율,3,FALSE))","v":""},{"$f":"IF(OR(D168=\"\",COUNTBLANK(F168:F174)=7),\"\",VLOOKUP(D168,평가_자유!$D$7:$X$46,20,FALSE))","v":""},{"$nulls":3},{"$f":"IF(G168=\"\",\"\",LEN(G168))","v":""}]
[{"$nulls":4},{"$f":"IF(VLOOKUP(C168,평가결과_자율,4,FALSE)=\"\",\"\",IF(메인!$J$8>=2,메인!$F$19,\"\"))","v":""},{"$f":"IF(VLOOKUP(C168,평가결과_자율,4,FALSE)=\"\",\"\",VLOOKUP(C168,평가결과_자율,4,FALSE))","v":""}]
[{"$nulls":4},{"$f":"IF(VLOOKUP(C168,평가결과_자율,5,FALSE)=\"\",\"\",IF(메인!$J$8>=3,메인!$F$20,\"\"))","v":""},{"$f":"IF(VLOOKUP(C168,평가결과_자율,5,FALSE)=\"\",\"\",VLOOKUP(C168,평가결과_자율,5,FALSE))","v":""}]
[{"$nulls":4},{"$f":"IF(VLOOKUP(C168,평가결과_자율,6,FALSE)=\"\",\"\",IF(메인!$J$8>=4,메인!$F$21,\"\"))","v":""},{"$f":"IF(VLOOKUP(C168,평가결과_자율,6,FALSE)=\"\",\"\",VLOOKUP(C168,평가결과_자율,6,FALSE))","v":""}]
[{"$nulls":4},{"$f":"IF(VLOOKUP(C168,평가결과_자율,7,FALSE)=\"\",\"\",IF(메인!$J$8>=5,메인!$F$22,\"\"))","v":""},{"$f":"IF(VLOOKUP(C168,평가결과_자율,7,FALSE)=\"\",\"\",VLOOKUP(C168,평가결과_자율,7,FALSE))","v":""}]
[{"$nulls":4},{"$f":"IF(VLOOKUP(C168,평가결과_자율,8,FALSE)=\"\",\"\",IF(메인!$J$8>=6,메인!$F$23,\"\"))","v":""},{"$f":"IF(VLOOKUP(C168,평가결과_자율,8,FALSE)=\"\",\"\",VLOOKUP(C168,평가결과_자율,8,FALSE))","v":""}]
[{"$nulls":4},{"$f":"IF(VLOOKUP(C168,평가결과_자율,9,FALSE)=\"\",\"\",IF(메인!$J$8>=7,메인!$F$24,\"\"))","v":""},{"$f":"IF(VLOOKUP(C168,평가결과_자율,9,FALSE)=\"\",\"\",VLOOKUP(C168,평가결과_자율,9,FALSE))","v":""}]
[null,null,25,{"$f":"IF(VLOOKUP(C175,학적,2,FALSE)=\"\",\"\",VLOOKUP(C175,학적,2,FALSE))","v":"학생25"},{"$f":"IF(VLOOKUP(C175,평가결과_자율,3,FALSE)=\"\",\"\",IF(메인!$J$8>=1,메인!$F$18,\"\"))","v":"재료의 가공"},{"$f":"IF(VLOOKUP(C175,평가결과_자율,3,FALSE)=\"\",\"\",VLOOKUP(C175,평가결과_자율,3,FALSE))","v":"전입"},{"$f":"IF(OR(D175=\"\",COUNTBLANK(F175:F181)=7),\"\",VLOOKUP(D175,평가_자유!$D$7:$X$46,20,FALSE))","v":" 한옥의 짜맞춤 구조물 만들기에서 부품의 제작이 정확하고 조립이 견고하여 완성도가 높음. 실내외 통로 구조물로서 단순한 계단의 구성 및 벽면과의 배치가 양호한 편임. 4인 가족의 주거공간 구상과 설계가 잘된 상태에서 주어진 재료를 이용한 부품 가공과 조립 및 꾸미기로 모형주택을 잘 만들었음."},{"$nulls":3},{"$f":"IF(G175=\"\",\"\",LEN(G175))","v":163}]
[{"$nulls":4},{"$f":"IF(VLOOKUP(C175,평가결과_자율,4,FALSE)=\"\",\"\",IF(메인!$J$8>=2,메인!$F$19,\"\"))","v":"전통 한옥 목재 맞춤 제작"},{"$f":"IF(VLOOKUP(C175,평가결과_자율,4,FALSE)=\"\",\"\",VLOOKUP(C175,평가결과_자율,4,FALSE))","v":"A"}]
[{"$nulls":4},{"$f":"IF(VLOOKUP(C175,평가결과_자율,5,FALSE)=\"\",\"\",IF(메인!$J$8>=3,메인!$F$20,\"\"))","v":"창의적 계단 모형 만들기"},{"$f":"IF(VLOOKUP(C175,평가결과_자율,5,FALSE)=\"\",\"\",VLOOKUP(C175,평가결과_자율,5,FALSE))","v":"B"}]
[{"$nulls":4},{"$f":"IF(VLOOKUP(C175,평가결과_자율,6,FALSE)=\"\",\"\",IF(메인!$J$8>=4,메인!$F$21,\"\"))","v":"창의적 모형주택 만들기"},{"$f":"IF(VLOOKUP(C175,평가결과_자율,6,FALSE)=\"\",\"\",VLOOKUP(C175,평가결과_자율,6,FALSE))","v":"A"}]
[{"$nulls":4},{"$f":"IF(VLOOKUP(C175,평가결과_자율,7,FALSE)=\"\",\"\",IF(메인!$J$8>=5,메인!$F$22,\"\"))","v":"창의적 교량 만들기"},{"$f":"IF(VLOOKUP(C175,평가결과_자율,7,FALSE)=\"\",\"\",VLOOKUP(C175,평가결과_자율,7,FALSE))","v":"A"}]
[{"$nulls":4},{"$f":"IF(VLOOKUP(C175,평가결과_자율,8,FALSE)=\"\",\"\",IF(메인!$J$8>=6,메인!$F$23,\"\"))","v":""},{"$f":"IF(VLOOKUP(C175,평가결과_자율,8,FALSE)=\"\",\"\",VLOOKUP(C175,평가결과_자율,8,FALSE))","v":""}]
[{"$nulls":4},{"$f":"IF(VLOOKUP(C175,평가결과_자율,9,FALSE)=\"\",\"\",IF(메인!$J$8>=7,메인!$F$24,\"\"))","v":""},{"$f":"IF(VLOOKUP(C175,평가결과_자율,9,FALSE)=\"\",\"\",VLOOKUP(C175,평가결과_자율,9,FALSE))","v":""}]
[null,null,26,{"$f":"IF(VLOOKUP(C182,학적,2,FALSE)=\"\",\"\",VLOOKUP(C182,학적,2,FALSE))","v":""},{"$f":"IF(VLOOKUP(C182,평가결과_자율,3,FALSE)=\"\",\"\",IF(메인!$J$8>=1,메인!$F$18,\"\"))","v":""},{"$f":"IF(VLOOKUP(C182,평가결과_자율,3,FALSE)=\"\",\"\",VLOOKUP(C182,평가결과_자율,3,FALSE))","v":""},{"$f":"IF(OR(D182=\"\",COUNTBLANK(F182:F188)=7),\"\",VLOOKUP(D182,평가_자유!$D$7:$X$46,20,FALSE))","v":""},{"$nulls":3},{"$f":"IF(G182=\"\",\"\",LEN(G182))","v":""}]
[{"$nulls":4},{"$f":"IF(VLOOKUP(C182,평가결과_자율,4,FALSE)=\"\",\"\",IF(메인!$J$8>=2,메인!$F$19,\"\"))","v":""},{"$f":"IF(VLOOKUP(C182,평가결과_자율,4,FALSE)=\"\",\"\",VLOOKUP(C182,평가결과_자율,4,FALSE))","v":""}]
[{"$nulls":4},{"$f":"IF(VLOOKUP(C182,평가결과_자율,5,FALSE)=\"\",\"\",IF(메인!$J$8>=3,메인!$F$20,\"\"))","v":""},{"$f":"IF(VLOOKUP(C182,평가결과_자율,5,FALSE)=\"\",\"\",VLOOKUP(C182,평가결과_자율,5,FALSE))","v":""}]
[{"$nulls":4},{"$f":"IF(VLOOKUP(C182,평가결과_자율,6,FALSE)=\"\",\"\",IF(메인!$J$8>=4,메인!$F$21,\"\"))","v":""},{"$f":"IF(VLOOKUP(C182,평가결과_자율,6,FALSE)=\"\",\"\",VLOOKUP(C182,평가결과_자율,6,FALSE))","v":""}]
[{"$nulls":4},{"$f":"IF(VLOOKUP(C182,평가결과_자율,7,FALSE)=\"\",\"\",IF(메인!$J$8>=5,메인!$F$22,\"\"))","v":""},{"$f":"IF(VLOOKUP(C182,평가결과_자율,7,FALSE)=\"\",\"\",VLOOKUP(C182,평가결과_자율,7,FALSE))","v":""}]
[{"$nulls":4},{"$f":"IF(VLOOKUP(C182,평가결과_자율,8,FALSE)=\"\",\"\",IF(메인!$J$8>=6,메인!$F$23,\"\"))","v":""},{"$f":"IF(VLOOKUP(C182,평가결과_자율,8,FALSE)=\"\",\"\",VLOOKUP(C182,평가결과_자율,8,FALSE))","v":""}]
[{"$nulls":4},{"$f":"IF(VLOOKUP(C182,평가결과_자율,9,FALSE)=\"\",\"\",IF(메인!$J$8>=7,메인!$F$24,\"\"))","v":""},{"$f":"IF(VLOOKUP(C182,평가결과_자율,9,FALSE)=\"\",\"\",VLOOKUP(C182,평가결과_자율,9,FALSE))","v":""}]
[null,null,27,{"$f":"IF(VLOOKUP(C189,학적,2,FALSE)=\"\",\"\",VLOOKUP(C189,학적,2,FALSE))","v":""},{"$f":"IF(VLOOKUP(C189,평가결과_자율,3,FALSE)=\"\",\"\",IF(메인!$J$8>=1,메인!$F$18,\"\"))","v":""},{"$f":"IF(VLOOKUP(C189,평가결과_자율,3,FALSE)=\"\",\"\",VLOOKUP(C189,평가결과_자율,3,FALSE))","v":""},{"$f":"IF(OR(D189=\"\",COUNTBLANK(F189:F195)=7),\"\",VLOOKUP(D189,평가_자유!$D$7:$X$46,20,FALSE))","v":""},{"$nulls":3},{"$f":"IF(G189=\"\",\"\",LEN(G189))","v":""}]
[{"$nulls":4},{"$f":"IF(VLOOKUP(C189,평가결과_자율,4,FALSE)=\"\",\"\",IF(메인!$J$8>=2,메인!$F$19,\"\"))","v":""},{"$f":"IF(VLOOKUP(C189,평가결과_자율,4,FALSE)=\"\",\"\",VLOOKUP(C189,평가결과_자율,4,FALSE))","v":""}]
[{"$nulls":4},{"$f":"IF(VLOOKUP(C189,평가결과_자율,5,FALSE)=\"\",\"\",IF(메인!$J$8>=3,메인!$F$20,\"\"))","v":""},{"$f":"IF(VLOOKUP(C189,평가결과_자율,5,FALSE)=\"\",\"\",VLOOKUP(C189,평가결과_자율,5,FALSE))","v":""}]
[{"$nulls":4},{"$f":"IF(VLOOKUP(C189,평가결과_자율,6,FALSE)=\"\",\"\",IF(메인!$J$8>=4,메인!$F$21,\"\"))","v":""},{"$f":"IF(VLOOKUP(C189,평가결과_자율,6,FALSE)=\"\",\"\",VLOOKUP(C189,평가결과_자율,6,FALSE))","v":""}]
[{"$nulls":4},{"$f":"IF(VLOOKUP(C189,평가결과_자율,7,FALSE)=\"\",\"\",IF(메인!$J$8>=5,메인!$F$22,\"\"))","v":""},{"$f":"IF(VLOOKUP(C189,평가결과_자율,7,FALSE)=\"\",\"\",VLOOKUP(C189,평가결과_자율,7,FALSE))","v":""}]
[{"$nulls":4},{"$f":"IF(VLOOKUP(C189,평가결과_자율,8,FALSE)=\"\",\"\",IF(메인!$J$8>=6,메인!$F$23,\"\"))","v":""},{"$f":"IF(VLOOKUP(C189,평가결과_자율,8,FALSE)=\"\",\"\",VLOOKUP(C189,평가결과_자율,8,FALSE))","v":""}]
[{"$nulls":4},{"$f":"IF(VLOOKUP(C189,평가결과_자율,9,FALSE)=\"\",\"\",IF(메인!$J$8>=7,메인!$F$24,\"\"))","v":""},{"$f":"IF(VLOOKUP(C189,평가결과_자율,9,FALSE)=\"\",\"\",VLOOKUP(C189,평가결과_자율,9,FALSE))","v":""}]
[null,null,28,{"$f":"IF(VLOOKUP(C196,학적,2,FALSE)=\"\",\"\",VLOOKUP(C196,학적,2,FALSE))","v":""},{"$f":"IF(VLOOKUP(C196,평가결과_자율,3,FALSE)=\"\",\"\",IF(메인!$J$8>=1,메인!$F$18,\"\"))","v":""},{"$f":"IF(VLOOKUP(C196,평가결과_자율,3,FALSE)=\"\",\"\",VLOOKUP(C196,평가결과_자율,3,FALSE))","v":""},{"$f":"IF(OR(D196=\"\",COUNTBLANK(F196:F202)=7),\"\",VLOOKUP(D196,평가_자유!$D$7:$X$46,20,FALSE))","v":""},{"$nulls":3},{"$f":"IF(G196=\"\",\"\",LEN(G196))","v":""}]
[{"$nulls":4},{"$f":"IF(VLOOKUP(C196,평가결과_자율,4,FALSE)=\"\",\"\",IF(메인!$J$8>=2,메인!$F$19,\"\"))","v":""},{"$f":"IF(VLOOKUP(C196,평가결과_자율,4,FALSE)=\"\",\"\",VLOOKUP(C196,평가결과_자율,4,FALSE))","v":""}]
[{"$nulls":4},{"$f":"IF(VLOOKUP(C196,평가결과_자율,5,FALSE)=\"\",\"\",IF(메인!$J$8>=3,메인!$F$20,\"\"))","v":""},{"$f":"IF(VLOOKUP(C196,평가결과_자율,5,FALSE)=\"\",\"\",VLOOKUP(C196,평가결과_자율,5,FALSE))","v":""}]
[{"$nulls":4},{"$f":"IF(VLOOKUP(C196,평가결과_자율,6,FALSE)=\"\",\"\",IF(메인!$J$8>=4,메인!$F$21,\"\"))","v":""},{"$f":"IF(VLOOKUP(C196,평가결과_자율,6,FALSE)=\"\",\"\",VLOOKUP(C196,평가결과_자율,6,FALSE))","v":""}]
[{"$nulls":4},{"$f":"IF(VLOOKUP(C196,평가결과_자율,7,FALSE)=\"\",\"\",IF(메인!$J$8>=5,메인!$F$22,\"\"))","v":""},{"$f":"IF(VLOOKUP(C196,평가결과_자율,7,FALSE)=\"\",\"\",VLOOKUP(C196,평가결과_자율,7,FALSE))","v":""}]
[{"$nulls":4},{"$f":"IF(VLOOKUP(C196,평가결과_자율,8,FALSE)=\"\",\"\",IF(메인!$J$8>=6,메인!$F$23,\"\"))","v":""},{"$f":"IF(VLOOKUP(C196,평가결과_자율,8,FALSE)=\"\",\"\",VLOOKUP(C196,평가결과_자율,8,FALSE))","v":""}]
[{"$nulls":4},{"$f":"IF(VLOOKUP(C196,평가결과_자율,9,FALSE)=\"\",\"\",IF(메인!$J$8>=7,메인!$F$24,\"\"))","v":""},{"$f":"IF(VLOOKUP(C196,평가결과_자율,9,FALSE)=\"\",\"\",VLOOKUP(C196,평가결과_자율,9,FALSE))","v":""}]
[null,null,29,{"$f":"IF(VLOOKUP(C203,학적,2,FALSE)=\"\",\"\",VLOOKUP(C203,학적,2,FALSE))","v":""},{"$f":"IF(VLOOKUP(C203,평가결과_자율,3,FALSE)=\"\",\"\",IF(메인!$J$8>=1,메인!$F$18,\"\"))","v":""},{"$f":"IF(VLOOKUP(C203,평가결과_자율,3,FALSE)=\"\",\"\",VLOOKUP(C203,평가결과_자율,3,FALSE))","v":""},{"$f":"IF(OR(D203=\"\",COUNTBLANK(F203:F209)=7),\"\",VLOOKUP(D203,평가_자유!$D$7:$X$46,20,FALSE))","v":""},{"$nulls":3},{"$f":"IF(G203=\"\",\"\",LEN(G203))","v":""}]
[{"$nulls":4},{"$f":"IF(VLOOKUP(C203,평가결과_자율,4,FALSE)=\"\",\"\",IF(메인!$J$8>=2,메인!$F$19,\"\"))","v":""},{"$f":"IF(VLOOKUP(C203,평가결과_자율,4,FALSE)=\"\",\"\",VLOOKUP(C203,평가결과_자율,4,FALSE))","v":""}]
[{"$nulls":4},{"$f":"IF(VLOOKUP(C203,평가결과_자율,5,FALSE)=\"\",\"\",IF(메인!$J$8>=3,메인!$F$20,\"\"))","v":""},{"$f":"IF(VLOOKUP(C203,평가결과_자율,5,FALSE)=\"\",\"\",VLOOKUP(C203,평가결과_자율,5,FALSE))","v":""}]
[{"$nulls":4},{"$f":"IF(VLOOKUP(C203,평가결과_자율,6,FALSE)=\"\",\"\",IF(메인!$J$8>=4,메인!$F$21,\"\"))","v":""},{"$f":"IF(VLOOKUP(C203,평가결과_자율,6,FALSE)=\"\",\"\",VLOOKUP(C203,평가결과_자율,6,FALSE))","v":""}]
[{"$nulls":4},{"$f":"IF(VLOOKUP(C203,평가결과_자율,7,FALSE)=\"\",\"\",IF(메인!$J$8>=5,메인!$F$22,\"\"))","v":""},{"$f":"IF(VLOOKUP(C203,평가결과_자율,7,FALSE)=\"\",\"\",VLOOKUP(C203,평가결과_자율,7,FALSE))","v":""}]
[{"$nulls":4},{"$f":"IF(VLOOKUP(C203,평가결과_자율,8,FALSE)=\"\",\"\",IF(메인!$J$8>=6,메인!$F$23,\"\"))","v":""},{"$f":"IF(VLOOKUP(C203,평가결과_자율,8,FALSE)=\"\",\"\",VLOOKUP(C203,평가결과_자율,8,FALSE))","v":""}]
[{"$nulls":4},{"$f":"IF(VLOOKUP(C203,평가결과_자율,9,FALSE)=\"\",\"\",IF(메인!$J$8>=7,메인!$F$24,\"\"))","v":""},{"$f":"IF(VLOOKUP(C203,평가결과_자율,9,FALSE)=\"\",\"\",VLOOKUP(C203,평가결과_자율,9,FALSE))","v":""}]
[null,null,30,{"$f":"IF(VLOOKUP(C210,학적,2,FALSE)=\"\",\"\",VLOOKUP(C210,학적,2,FALSE))","v":""},{"$f":"IF(VLOOKUP(C210,평가결과_자율,3,FALSE)=\"\",\"\",IF(메인!$J$8>=1,메인!$F$18,\"\"))","v":""},{"$f":"IF(VLOOKUP(C210,평가결과_자율,3,FALSE)=\"\",\"\",VLOOKUP(C210,평가결과_자율,3,FALSE))","v":""},{"$f":"IF(OR(D210=\"\",COUNTBLANK(F210:F216)=7),\"\",VLOOKUP(D210,평가_자유!$D$7:$X$46,20,FALSE))","v":""},{"$nulls":3},{"$f":"IF(G210=\"\",\"\",LEN(G210))","v":""}]
[{"$nulls":4},{"$f":"IF(VLOOKUP(C210,평가결과_자율,4,FALSE)=\"\",\"\",IF(메인!$J$8>=2,메인!$F$19,\"\"))","v":""},{"$f":"IF(VLOOKUP(C210,평가결과_자율,4,FALSE)=\"\",\"\",VLOOKUP(C210,평가결과_자율,4,FALSE))","v":""}]
[{"$nulls":4},{"$f":"IF(VLOOKUP(C210,평가결과_자율,5,FALSE)=\"\",\"\",IF(메인!$J$8>=3,메인!$F$20,\"\"))","v":""},{"$f":"IF(VLOOKUP(C210,평가결과_자율,5,FALSE)=\"\",\"\",VLOOKUP(C210,평가결과_자율,5,FALSE))","v":""}]
[{"$nulls":4},{"$f":"IF(VLOOKUP(C210,평가결과_자율,6,FALSE)=\"\",\"\",IF(메인!$J$8>=4,메인!$F$21,\"\"))","v":""},{"$f":"IF(VLOOKUP(C210,평가결과_자율,6,FALSE)=\"\",\"\",VLOOKUP(C210,평가결과_자율,6,FALSE))","v":""}]
[{"$nulls":4},{"$f":"IF(VLOOKUP(C210,평가결과_자율,7,FALSE)=\"\",\"\",IF(메인!$J$8>=5,메인!$F$22,\"\"))","v":""},{"$f":"IF(VLOOKUP(C210,평가결과_자율,7,FALSE)=\"\",\"\",VLOOKUP(C210,평가결과_자율,7,FALSE))","v":""}]
[{"$nulls":4},{"$f":"IF(VLOOKUP(C210,평가결과_자율,8,FALSE)=\"\",\"\",IF(메인!$J$8>=6,메인!$F$23,\"\"))","v":""},{"$f":"IF(VLOOKUP(C210,평가결과_자율,8,FALSE)=\"\",\"\",VLOOKUP(C210,평가결과_자율,8,FALSE))","v":""}]
[{"$nulls":4},{"$f":"IF(VLOOKUP(C210,평가결과_자율,9,FALSE)=\"\",\"\",IF(메인!$J$8>=7,메인!$F$24,\"\"))","v":""},{"$f":"IF(VLOOKUP(C210,평가결과_자율,9,FALSE)=\"\",\"\",VLOOKUP(C210,평가결과_자율,9,FALSE))","v":""}]
[null,null,31,{"$f":"IF(VLOOKUP(C217,학적,2,FALSE)=\"\",\"\",VLOOKUP(C217,학적,2,FALSE))","v":""},{"$f":"IF(VLOOKUP(C217,평가결과_자율,3,FALSE)=\"\",\"\",IF(메인!$J$8>=1,메인!$F$18,\"\"))","v":""},{"$f":"IF(VLOOKUP(C217,평가결과_자율,3,FALSE)=\"\",\"\",VLOOKUP(C217,평가결과_자율,3,FALSE))","v":""},{"$f":"IF(OR(D217=\"\",COUNTBLANK(F217:F223)=7),\"\",VLOOKUP(D217,평가_자유!$D$7:$X$46,20,FALSE))","v":""},{"$nulls":3},{"$f":"IF(G217=\"\",\"\",LEN(G217))","v":""}]
[{"$nulls":4},{"$f":"IF(VLOOKUP(C217,평가결과_자율,4,FALSE)=\"\",\"\",IF(메인!$J$8>=2,메인!$F$19,\"\"))","v":""},{"$f":"IF(VLOOKUP(C217,평가결과_자율,4,FALSE)=\"\",\"\",VLOOKUP(C217,평가결과_자율,4,FALSE))","v":""}]
[{"$nulls":4},{"$f":"IF(VLOOKUP(C217,평가결과_자율,5,FALSE)=\"\",\"\",IF(메인!$J$8>=3,메인!$F$20,\"\"))","v":""},{"$f":"IF(VLOOKUP(C217,평가결과_자율,5,FALSE)=\"\",\"\",VLOOKUP(C217,평가결과_자율,5,FALSE))","v":""}]
[{"$nulls":4},{"$f":"IF(VLOOKUP(C217,평가결과_자율,6,FALSE)=\"\",\"\",IF(메인!$J$8>=4,메인!$F$21,\"\"))","v":""},{"$f":"IF(VLOOKUP(C217,평가결과_자율,6,FALSE)=\"\",\"\",VLOOKUP(C217,평가결과_자율,6,FALSE))","v":""}]
[{"$nulls":4},{"$f":"IF(VLOOKUP(C217,평가결과_자율,7,FALSE)=\"\",\"\",IF(메인!$J$8>=5,메인!$F$22,\"\"))","v":""},{"$f":"IF(VLOOKUP(C217,평가결과_자율,7,FALSE)=\"\",\"\",VLOOKUP(C217,평가결과_자율,7,FALSE))","v":""}]
[{"$nulls":4},{"$f":"IF(VLOOKUP(C217,평가결과_자율,8,FALSE)=\"\",\"\",IF(메인!$J$8>=6,메인!$F$23,\"\"))","v":""},{"$f":"IF(VLOOKUP(C217,평가결과_자율,8,FALSE)=\"\",\"\",VLOOKUP(C217,평가결과_자율,8,FALSE))","v":""}]
[{"$nulls":4},{"$f":"IF(VLOOKUP(C217,평가결과_자율,9,FALSE)=\"\",\"\",IF(메인!$J$8>=7,메인!$F$24,\"\"))","v":""},{"$f":"IF(VLOOKUP(C217,평가결과_자율,9,FALSE)=\"\",\"\",VLOOKUP(C217,평가결과_자율,9,FALSE))","v":""}]
[null,null,32,{"$f":"IF(VLOOKUP(C224,학적,2,FALSE)=\"\",\"\",VLOOKUP(C224,학적,2,FALSE))","v":""},{"$f":"IF(VLOOKUP(C224,평가결과_자율,3,FALSE)=\"\",\"\",IF(메인!$J$8>=1,메인!$F$18,\"\"))","v":""},{"$f":"IF(VLOOKUP(C224,평가결과_자율,3,FALSE)=\"\",\"\",VLOOKUP(C224,평가결과_자율,3,FALSE))","v":""},{"$f":"IF(OR(D224=\"\",COUNTBLANK(F224:F230)=7),\"\",VLOOKUP(D224,평가_자유!$D$7:$X$46,20,FALSE))","v":""},{"$nulls":3},{"$f":"IF(G224=\"\",\"\",LEN(G224))","v":""}]
[{"$nulls":4},{"$f":"IF(VLOOKUP(C224,평가결과_자율,4,FALSE)=\"\",\"\",IF(메인!$J$8>=2,메인!$F$19,\"\"))","v":""},{"$f":"IF(VLOOKUP(C224,평가결과_자율,4,FALSE)=\"\",\"\",VLOOKUP(C224,평가결과_자율,4,FALSE))","v":""}]
[{"$nulls":4},{"$f":"IF(VLOOKUP(C224,평가결과_자율,5,FALSE)=\"\",\"\",IF(메인!$J$8>=3,메인!$F$20,\"\"))","v":""},{"$f":"IF(VLOOKUP(C224,평가결과_자율,5,FALSE)=\"\",\"\",VLOOKUP(C224,평가결과_자율,5,FALSE))","v":""}]
[{"$nulls":4},{"$f":"IF(VLOOKUP(C224,평가결과_자율,6,FALSE)=\"\",\"\",IF(메인!$J$8>=4,메인!$F$21,\"\"))","v":""},{"$f":"IF(VLOOKUP(C224,평가결과_자율,6,FALSE)=\"\",\"\",VLOOKUP(C224,평가결과_자율,6,FALSE))","v":""}]
[{"$nulls":4},{"$f":"IF(VLOOKUP(C224,평가결과_자율,7,FALSE)=\"\",\"\",IF(메인!$J$8>=5,메인!$F$22,\"\"))","v":""},{"$f":"IF(VLOOKUP(C224,평가결과_자율,7,FALSE)=\"\",\"\",VLOOKUP(C224,평가결과_자율,7,FALSE))","v":""}]
[{"$nulls":4},{"$f":"IF(VLOOKUP(C224,평가결과_자율,8,FALSE)=\"\",\"\",IF(메인!$J$8>=6,메인!$F$23,\"\"))","v":""},{"$f":"IF(VLOOKUP(C224,평가결과_자율,8,FALSE)=\"\",\"\",VLOOKUP(C224,평가결과_자율,8,FALSE))","v":""}]
[{"$nulls":4},{"$f":"IF(VLOOKUP(C224,평가결과_자율,9,FALSE)=\"\",\"\",IF(메인!$J$8>=7,메인!$F$24,\"\"))","v":""},{"$f":"IF(VLOOKUP(C224,평가결과_자율,9,FALSE)=\"\",\"\",VLOOKUP(C224,평가결과_자율,9,FALSE))","v":""}]
[null,null,33,{"$f":"IF(VLOOKUP(C231,학적,2,FALSE)=\"\",\"\",VLOOKUP(C231,학적,2,FALSE))","v":""},{"$f":"IF(VLOOKUP(C231,평가결과_자율,3,FALSE)=\"\",\"\",IF(메인!$J$8>=1,메인!$F$18,\"\"))","v":""},{"$f":"IF(VLOOKUP(C231,평가결과_자율,3,FALSE)=\"\",\"\",VLOOKUP(C231,평가결과_자율,3,FALSE))","v":""},{"$f":"IF(OR(D231=\"\",COUNTBLANK(F231:F237)=7),\"\",VLOOKUP(D231,평가_자유!$D$7:$X$46,20,FALSE))","v":""},{"$nulls":3},{"$f":"IF(G231=\"\",\"\",LEN(G231))","v":""}]
[{"$nulls":4},{"$f":"IF(VLOOKUP(C231,평가결과_자율,4,FALSE)=\"\",\"\",IF(메인!$J$8>=2,메인!$F$19,\"\"))","v":""},{"$f":"IF(VLOOKUP(C231,평가결과_자율,4,FALSE)=\"\",\"\",VLOOKUP(C231,평가결과_자율,4,FALSE))","v":""}]
[{"$nulls":4},{"$f":"IF(VLOOKUP(C231,평가결과_자율,5,FALSE)=\"\",\"\",IF(메인!$J$8>=3,메인!$F$20,\"\"))","v":""},{"$f":"IF(VLOOKUP(C231,평가결과_자율,5,FALSE)=\"\",\"\",VLOOKUP(C231,평가결과_자율,5,FALSE))","v":""}]
[{"$nulls":4},{"$f":"IF(VLOOKUP(C231,평가결과_자율,6,FALSE)=\"\",\"\",IF(메인!$J$8>=4,메인!$F$21,\"\"))","v":""},{"$f":"IF(VLOOKUP(C231,평가결과_자율,6,FALSE)=\"\",\"\",VLOOKUP(C231,평가결과_자율,6,FALSE))","v":""}]
[{"$nulls":4},{"$f":"IF(VLOOKUP(C231,평가결과_자율,7,FALSE)=\"\",\"\",IF(메인!$J$8>=5,메인!$F$22,\"\"))","v":""},{"$f":"IF(VLOOKUP(C231,평가결과_자율,7,FALSE)=\"\",\"\",VLOOKUP(C231,평가결과_자율,7,FALSE))","v":""}]
[{"$nulls":4},{"$f":"IF(VLOOKUP(C231,평가결과_자율,8,FALSE)=\"\",\"\",IF(메인!$J$8>=6,메인!$F$23,\"\"))","v":""},{"$f":"IF(VLOOKUP(C231,평가결과_자율,8,FALSE)=\"\",\"\",VLOOKUP(C231,평가결과_자율,8,FALSE))","v":""}]
[{"$nulls":4},{"$f":"IF(VLOOKUP(C231,평가결과_자율,9,FALSE)=\"\",\"\",IF(메인!$J$8>=7,메인!$F$24,\"\"))","v":""},{"$f":"IF(VLOOKUP(C231,평가결과_자율,9,FALSE)=\"\",\"\",VLOOKUP(C231,평가결과_자율,9,FALSE))","v":""}]
[null,null,34,{"$f":"IF(VLOOKUP(C238,학적,2,FALSE)=\"\",\"\",VLOOKUP(C238,학적,2,FALSE))","v":""},{"$f":"IF(VLOOKUP(C238,평가결과_자율,3,FALSE)=\"\",\"\",IF(메인!$J$8>=1,메인!$F$18,\"\"))","v":""},{"$f":"IF(VLOOKUP(C238,평가결과_자율,3,FALSE)=\"\",\"\",VLOOKUP(C238,평가결과_자율,3,FALSE))","v":""},{"$f":"IF(OR(D238=\"\",COUNTBLANK(F238:F244)=7),\"\",VLOOKUP(D238,평가_자유!$D$7:$X$46,20,FALSE))","v":""},{"$nulls":3},{"$f":"IF(G238=\"\",\"\",LEN(G238))","v":""}]
[{"$nulls":4},{"$f":"IF(VLOOKUP(C238,평가결과_자율,4,FALSE)=\"\",\"\",IF(메인!$J$8>=2,메인!$F$19,\"\"))","v":""},{"$f":"IF(VLOOKUP(C238,평가결과_자율,4,FALSE)=\"\",\"\",VLOOKUP(C238,평가결과_자율,4,FALSE))","v":""}]
[{"$nulls":4},{"$f":"IF(VLOOKUP(C238,평가결과_자율,5,FALSE)=\"\",\"\",IF(메인!$J$8>=3,메인!$F$20,\"\"))","v":""},{"$f":"IF(VLOOKUP(C238,평가결과_자율,5,FALSE)=\"\",\"\",VLOOKUP(C238,평가결과_자율,5,FALSE))","v":""}]
[{"$nulls":4},{"$f":"IF(VLOOKUP(C238,평가결과_자율,6,FALSE)=\"\",\"\",IF(메인!$J$8>=4,메인!$F$21,\"\"))","v":""},{"$f":"IF(VLOOKUP(C238,평가결과_자율,6,FALSE)=\"\",\"\",VLOOKUP(C238,평가결과_자율,6,FALSE))","v":""}]
[{"$nulls":4},{"$f":"IF(VLOOKUP(C238,평가결과_자율,7,FALSE)=\"\",\"\",IF(메인!$J$8>=5,메인!$F$22,\"\"))","v":""},{"$f":"IF(VLOOKUP(C238,평가결과_자율,7,FALSE)=\"\",\"\",VLOOKUP(C238,평가결과_자율,7,FALSE))","v":""}]
[{"$nulls":4},{"$f":"IF(VLOOKUP(C238,평가결과_자율,8,FALSE)=\"\",\"\",IF(메인!$J$8>=6,메인!$F$23,\"\"))","v":""},{"$f":"IF(VLOOKUP(C238,평가결과_자율,8,FALSE)=\"\",\"\",VLOOKUP(C238,평가결과_자율,8,FALSE))","v":""}]
[{"$nulls":4},{"$f":"IF(VLOOKUP(C238,평가결과_자율,9,FALSE)=\"\",\"\",IF(메인!$J$8>=7,메인!$F$24,\"\"))","v":""},{"$f":"IF(VLOOKUP(C238,평가결과_자율,9,FALSE)=\"\",\"\",VLOOKUP(C238,평가결과_자율,9,FALSE))","v":""}]
[null,null,35,{"$f":"IF(VLOOKUP(C245,학적,2,FALSE)=\"\",\"\",VLOOKUP(C245,학적,2,FALSE))","v":""},{"$f":"IF(VLOOKUP(C245,평가결과_자율,3,FALSE)=\"\",\"\",IF(메인!$J$8>=1,메인!$F$18,\"\"))","v":""},{"$f":"IF(VLOOKUP(C245,평가결과_자율,3,FALSE)=\"\",\"\",VLOOKUP(C245,평가결과_자율,3,FALSE))","v":""},{"$f":"IF(OR(D245=\"\",COUNTBLANK(F245:F251)=7),\"\",VLOOKUP(D245,평가_자유!$D$7:$X$46,20,FALSE))","v":""},{"$nulls":3},{"$f":"IF(G245=\"\",\"\",LEN(G245))","v":""}]
[{"$nulls":4},{"$f":"IF(VLOOKUP(C245,평가결과_자율,4,FALSE)=\"\",\"\",IF(메인!$J$8>=2,메인!$F$19,\"\"))","v":""},{"$f":"IF(VLOOKUP(C245,평가결과_자율,4,FALSE)=\"\",\"\",VLOOKUP(C245,평가결과_자율,4,FALSE))","v":""}]
[{"$nulls":4},{"$f":"IF(VLOOKUP(C245,평가결과_자율,5,FALSE)=\"\",\"\",IF(메인!$J$8>=3,메인!$F$20,\"\"))","v":""},{"$f":"IF(VLOOKUP(C245,평가결과_자율,5,FALSE)=\"\",\"\",VLOOKUP(C245,평가결과_자율,5,FALSE))","v":""}]
[{"$nulls":4},{"$f":"IF(VLOOKUP(C245,평가결과_자율,6,FALSE)=\"\",\"\",IF(메인!$J$8>=4,메인!$F$21,\"\"))","v":""},{"$f":"IF(VLOOKUP(C245,평가결과_자율,6,FALSE)=\"\",\"\",VLOOKUP(C245,평가결과_자율,6,FALSE))","v":""}]
[{"$nulls":4},{"$f":"IF(VLOOKUP(C245,평가결과_자율,7,FALSE)=\"\",\"\",IF(메인!$J$8>=5,메인!$F$22,\"\"))","v":""},{"$f":"IF(VLOOKUP(C245,평가결과_자율,7,FALSE)=\"\",\"\",VLOOKUP(C245,평가결과_자율,7,FALSE))","v":""}]
[{"$nulls":4},{"$f":"IF(VLOOKUP(C245,평가결과_자율,8,FALSE)=\"\",\"\",IF(메인!$J$8>=6,메인!$F$23,\"\"))","v":""},{"$f":"IF(VLOOKUP(C245,평가결과_자율,8,FALSE)=\"\",\"\",VLOOKUP(C245,평가결과_자율,8,FALSE))","v":""}]
[{"$nulls":4},{"$f":"IF(VLOOKUP(C245,평가결과_자율,9,FALSE)=\"\",\"\",IF(메인!$J$8>=7,메인!$F$24,\"\"))","v":""},{"$f":"IF(VLOOKUP(C245,평가결과_자율,9,FALSE)=\"\",\"\",VLOOKUP(C245,평가결과_자율,9,FALSE))","v":""}]
[null,null,36,{"$f":"IF(VLOOKUP(C252,학적,2,FALSE)=\"\",\"\",VLOOKUP(C252,학적,2,FALSE))","v":""},{"$f":"IF(VLOOKUP(C252,평가결과_자율,3,FALSE)=\"\",\"\",IF(메인!$J$8>=1,메인!$F$18,\"\"))","v":""},{"$f":"IF(VLOOKUP(C252,평가결과_자율,3,FALSE)=\"\",\"\",VLOOKUP(C252,평가결과_자율,3,FALSE))","v":""},{"$f":"IF(OR(D252=\"\",COUNTBLANK(F252:F258)=7),\"\",VLOOKUP(D252,평가_자유!$D$7:$X$46,20,FALSE))","v":""},{"$nulls":3},{"$f":"IF(G252=\"\",\"\",LEN(G252))","v":""}]
[{"$nulls":4},{"$f":"IF(VLOOKUP(C252,평가결과_자율,4,FALSE)=\"\",\"\",IF(메인!$J$8>=2,메인!$F$19,\"\"))","v":""},{"$f":"IF(VLOOKUP(C252,평가결과_자율,4,FALSE)=\"\",\"\",VLOOKUP(C252,평가결과_자율,4,FALSE))","v":""}]
[{"$nulls":4},{"$f":"IF(VLOOKUP(C252,평가결과_자율,5,FALSE)=\"\",\"\",IF(메인!$J$8>=3,메인!$F$20,\"\"))","v":""},{"$f":"IF(VLOOKUP(C252,평가결과_자율,5,FALSE)=\"\",\"\",VLOOKUP(C252,평가결과_자율,5,FALSE))","v":""}]
[{"$nulls":4},{"$f":"IF(VLOOKUP(C252,평가결과_자율,6,FALSE)=\"\",\"\",IF(메인!$J$8>=4,메인!$F$21,\"\"))","v":""},{"$f":"IF(VLOOKUP(C252,평가결과_자율,6,FALSE)=\"\",\"\",VLOOKUP(C252,평가결과_자율,6,FALSE))","v":""}]
[{"$nulls":4},{"$f":"IF(VLOOKUP(C252,평가결과_자율,7,FALSE)=\"\",\"\",IF(메인!$J$8>=5,메인!$F$22,\"\"))","v":""},{"$f":"IF(VLOOKUP(C252,평가결과_자율,7,FALSE)=\"\",\"\",VLOOKUP(C252,평가결과_자율,7,FALSE))","v":""}]
[{"$nulls":4},{"$f":"IF(VLOOKUP(C252,평가결과_자율,8,FALSE)=\"\",\"\",IF(메인!$J$8>=6,메인!$F$23,\"\"))","v":""},{"$f":"IF(VLOOKUP(C252,평가결과_자율,8,FALSE)=\"\",\"\",VLOOKUP(C252,평가결과_자율,8,FALSE))","v":""}]
[{"$nulls":4},{"$f":"IF(VLOOKUP(C252,평가결과_자율,9,FALSE)=\"\",\"\",IF(메인!$J$8>=7,메인!$F$24,\"\"))","v":""},{"$f":"IF(VLOOKUP(C252,평가결과_자율,9,FALSE)=\"\",\"\",VLOOKUP(C252,평가결과_자율,9,FALSE))","v":""}]
[null,null,37,{"$f":"IF(VLOOKUP(C259,학적,2,FALSE)=\"\",\"\",VLOOKUP(C259,학적,2,FALSE))","v":""},{"$f":"IF(VLOOKUP(C259,평가결과_자율,3,FALSE)=\"\",\"\",IF(메인!$J$8>=1,메인!$F$18,\"\"))","v":""},{"$f":"IF(VLOOKUP(C259,평가결과_자율,3,FALSE)=\"\",\"\",VLOOKUP(C259,평가결과_자율,3,FALSE))","v":""},{"$f":"IF(OR(D259=\"\",COUNTBLANK(F259:F265)=7),\"\",VLOOKUP(D259,평가_자유!$D$7:$X$46,20,FALSE))","v":""},{"$nulls":3},{"$f":"IF(G259=\"\",\"\",LEN(G259))","v":""}]
[{"$nulls":4},{"$f":"IF(VLOOKUP(C259,평가결과_자율,4,FALSE)=\"\",\"\",IF(메인!$J$8>=2,메인!$F$19,\"\"))","v":""},{"$f":"IF(VLOOKUP(C259,평가결과_자율,4,FALSE)=\"\",\"\",VLOOKUP(C259,평가결과_자율,4,FALSE))","v":""}]
[{"$nulls":4},{"$f":"IF(VLOOKUP(C259,평가결과_자율,5,FALSE)=\"\",\"\",IF(메인!$J$8>=3,메인!$F$20,\"\"))","v":""},{"$f":"IF(VLOOKUP(C259,평가결과_자율,5,FALSE)=\"\",\"\",VLOOKUP(C259,평가결과_자율,5,FALSE))","v":""}]
[{"$nulls":4},{"$f":"IF(VLOOKUP(C259,평가결과_자율,6,FALSE)=\"\",\"\",IF(메인!$J$8>=4,메인!$F$21,\"\"))","v":""},{"$f":"IF(VLOOKUP(C259,평가결과_자율,6,FALSE)=\"\",\"\",VLOOKUP(C259,평가결과_자율,6,FALSE))","v":""}]
[{"$nulls":4},{"$f":"IF(VLOOKUP(C259,평가결과_자율,7,FALSE)=\"\",\"\",IF(메인!$J$8>=5,메인!$F$22,\"\"))","v":""},{"$f":"IF(VLOOKUP(C259,평가결과_자율,7,FALSE)=\"\",\"\",VLOOKUP(C259,평가결과_자율,7,FALSE))","v":""}]
[{"$nulls":4},{"$f":"IF(VLOOKUP(C259,평가결과_자율,8,FALSE)=\"\",\"\",IF(메인!$J$8>=6,메인!$F$23,\"\"))","v":""},{"$f":"IF(VLOOKUP(C259,평가결과_자율,8,FALSE)=\"\",\"\",VLOOKUP(C259,평가결과_자율,8,FALSE))","v":""}]
[{"$nulls":4},{"$f":"IF(VLOOKUP(C259,평가결과_자율,9,FALSE)=\"\",\"\",IF(메인!$J$8>=7,메인!$F$24,\"\"))","v":""},{"$f":"IF(VLOOKUP(C259,평가결과_자율,9,FALSE)=\"\",\"\",VLOOKUP(C259,평가결과_자율,9,FALSE))","v":""}]
[null,null,38,{"$f":"IF(VLOOKUP(C266,학적,2,FALSE)=\"\",\"\",VLOOKUP(C266,학적,2,FALSE))","v":""},{"$f":"IF(VLOOKUP(C266,평가결과_자율,3,FALSE)=\"\",\"\",IF(메인!$J$8>=1,메인!$F$18,\"\"))","v":""},{"$f":"IF(VLOOKUP(C266,평가결과_자율,3,FALSE)=\"\",\"\",VLOOKUP(C266,평가결과_자율,3,FALSE))","v":""},{"$f":"IF(OR(D266=\"\",COUNTBLANK(F266:F272)=7),\"\",VLOOKUP(D266,평가_자유!$D$7:$X$46,20,FALSE))","v":""},{"$nulls":3},{"$f":"IF(G266=\"\",\"\",LEN(G266))","v":""}]
[{"$nulls":4},{"$f":"IF(VLOOKUP(C266,평가결과_자율,4,FALSE)=\"\",\"\",IF(메인!$J$8>=2,메인!$F$19,\"\"))","v":""},{"$f":"IF(VLOOKUP(C266,평가결과_자율,4,FALSE)=\"\",\"\",VLOOKUP(C266,평가결과_자율,4,FALSE))","v":""}]
[{"$nulls":4},{"$f":"IF(VLOOKUP(C266,평가결과_자율,5,FALSE)=\"\",\"\",IF(메인!$J$8>=3,메인!$F$20,\"\"))","v":""},{"$f":"IF(VLOOKUP(C266,평가결과_자율,5,FALSE)=\"\",\"\",VLOOKUP(C266,평가결과_자율,5,FALSE))","v":""}]
[{"$nulls":4},{"$f":"IF(VLOOKUP(C266,평가결과_자율,6,FALSE)=\"\",\"\",IF(메인!$J$8>=4,메인!$F$21,\"\"))","v":""},{"$f":"IF(VLOOKUP(C266,평가결과_자율,6,FALSE)=\"\",\"\",VLOOKUP(C266,평가결과_자율,6,FALSE))","v":""}]
[{"$nulls":4},{"$f":"IF(VLOOKUP(C266,평가결과_자율,7,FALSE)=\"\",\"\",IF(메인!$J$8>=5,메인!$F$22,\"\"))","v":""},{"$f":"IF(VLOOKUP(C266,평가결과_자율,7,FALSE)=\"\",\"\",VLOOKUP(C266,평가결과_자율,7,FALSE))","v":""}]
[{"$nulls":4},{"$f":"IF(VLOOKUP(C266,평가결과_자율,8,FALSE)=\"\",\"\",IF(메인!$J$8>=6,메인!$F$23,\"\"))","v":""},{"$f":"IF(VLOOKUP(C266,평가결과_자율,8,FALSE)=\"\",\"\",VLOOKUP(C266,평가결과_자율,8,FALSE))","v":""}]
[{"$nulls":4},{"$f":"IF(VLOOKUP(C266,평가결과_자율,9,FALSE)=\"\",\"\",IF(메인!$J$8>=7,메인!$F$24,\"\"))","v":""},{"$f":"IF(VLOOKUP(C266,평가결과_자율,9,FALSE)=\"\",\"\",VLOOKUP(C266,평가결과_자율,9,FALSE))","v":""}]
[null,null,39,{"$f":"IF(VLOOKUP(C273,학적,2,FALSE)=\"\",\"\",VLOOKUP(C273,학적,2,FALSE))","v":""},{"$f":"IF(VLOOKUP(C273,평가결과_자율,3,FALSE)=\"\",\"\",IF(메인!$J$8>=1,메인!$F$18,\"\"))","v":""},{"$f":"IF(VLOOKUP(C273,평가결과_자율,3,FALSE)=\"\",\"\",VLOOKUP(C273,평가결과_자율,3,FALSE))","v":""},{"$f":"IF(OR(D273=\"\",COUNTBLANK(F273:F279)=7),\"\",VLOOKUP(D273,평가_자유!$D$7:$X$46,20,FALSE))","v":""},{"$nulls":3},{"$f":"IF(G273=\"\",\"\",LEN(G273))","v":""}]
[{"$nulls":4},{"$f":"IF(VLOOKUP(C273,평가결과_자율,4,FALSE)=\"\",\"\",IF(메인!$J$8>=2,메인!$F$19,\"\"))","v":""},{"$f":"IF(VLOOKUP(C273,평가결과_자율,4,FALSE)=\"\",\"\",VLOOKUP(C273,평가결과_자율,4,FALSE))","v":""}]
[{"$nulls":4},{"$f":"IF(VLOOKUP(C273,평가결과_자율,5,FALSE)=\"\",\"\",IF(메인!$J$8>=3,메인!$F$20,\"\"))","v":""},{"$f":"IF(VLOOKUP(C273,평가결과_자율,5,FALSE)=\"\",\"\",VLOOKUP(C273,평가결과_자율,5,FALSE))","v":""}]
[{"$nulls":4},{"$f":"IF(VLOOKUP(C273,평가결과_자율,6,FALSE)=\"\",\"\",IF(메인!$J$8>=4,메인!$F$21,\"\"))","v":""},{"$f":"IF(VLOOKUP(C273,평가결과_자율,6,FALSE)=\"\",\"\",VLOOKUP(C273,평가결과_자율,6,FALSE))","v":""}]
[{"$nulls":4},{"$f":"IF(VLOOKUP(C273,평가결과_자율,7,FALSE)=\"\",\"\",IF(메인!$J$8>=5,메인!$F$22,\"\"))","v":""},{"$f":"IF(VLOOKUP(C273,평가결과_자율,7,FALSE)=\"\",\"\",VLOOKUP(C273,평가결과_자율,7,FALSE))","v":""}]
[{"$nulls":4},{"$f":"IF(VLOOKUP(C273,평가결과_자율,8,FALSE)=\"\",\"\",IF(메인!$J$8>=6,메인!$F$23,\"\"))","v":""},{"$f":"IF(VLOOKUP(C273,평가결과_자율,8,FALSE)=\"\",\"\",VLOOKUP(C273,평가결과_자율,8,FALSE))","v":""}]
[{"$nulls":4},{"$f":"IF(VLOOKUP(C273,평가결과_자율,9,FALSE)=\"\",\"\",IF(메인!$J$8>=7,메인!$F$24,\"\"))","v":""},{"$f":"IF(VLOOKUP(C273,평가결과_자율,9,FALSE)=\"\",\"\",VLOOKUP(C273,평가결과_자율,9,FALSE))","v":""}]
[null,null,40,{"$f":"IF(VLOOKUP(C280,학적,2,FALSE)=\"\",\"\",VLOOKUP(C280,학적,2,FALSE))","v":""},{"$f":"IF(VLOOKUP(C280,평가결과_자율,3,FALSE)=\"\",\"\",IF(메인!$J$8>=1,메인!$F$18,\"\"))","v":""},{"$f":"IF(VLOOKUP(C280,평가결과_자율,3,FALSE)=\"\",\"\",VLOOKUP(C280,평가결과_자율,3,FALSE))","v":""},{"$f":"IF(OR(D280=\"\",COUNTBLANK(F280:F286)=7),\"\",VLOOKUP(D280,평가_자유!$D$7:$X$46,20,FALSE))","v":""},{"$nulls":3},{"$f":"IF(G280=\"\",\"\",LEN(G280))","v":""}]
[{"$nulls":4},{"$f":"IF(VLOOKUP(C280,평가결과_자율,4,FALSE)=\"\",\"\",IF(메인!$J$8>=2,메인!$F$19,\"\"))","v":""},{"$f":"IF(VLOOKUP(C280,평가결과_자율,4,FALSE)=\"\",\"\",VLOOKUP(C280,평가결과_자율,4,FALSE))","v":""}]
[{"$nulls":4},{"$f":"IF(VLOOKUP(C280,평가결과_자율,5,FALSE)=\"\",\"\",IF(메인!$J$8>=3,메인!$F$20,\"\"))","v":""},{"$f":"IF(VLOOKUP(C280,평가결과_자율,5,FALSE)=\"\",\"\",VLOOKUP(C280,평가결과_자율,5,FALSE))","v":""}]
[{"$nulls":4},{"$f":"IF(VLOOKUP(C280,평가결과_자율,6,FALSE)=\"\",\"\",IF(메인!$J$8>=4,메인!$F$21,\"\"))","v":""},{"$f":"IF(VLOOKUP(C280,평가결과_자율,6,FALSE)=\"\",\"\",VLOOKUP(C280,평가결과_자율,6,FALSE))","v":""}]
[{"$nulls":4},{"$f":"IF(VLOOKUP(C280,평가결과_자율,7,FALSE)=\"\",\"\",IF(메인!$J$8>=5,메인!$F$22,\"\"))","v":""},{"$f":"IF(VLOOKUP(C280,평가결과_자율,7,FALSE)=\"\",\"\",VLOOKUP(C280,평가결과_자율,7,FALSE))","v":""}]
[{"$nulls":4},{"$f":"IF(VLOOKUP(C280,평가결과_자율,8,FALSE)=\"\",\"\",IF(메인!$J$8>=6,메인!$F$23,\"\"))","v":""},{"$f":"IF(VLOOKUP(C280,평가결과_자율,8,FALSE)=\"\",\"\",VLOOKUP(C280,평가결과_자율,8,FALSE))","v":""}]
[{"$nulls":4},{"$f":"IF(VLOOKUP(C280,평가결과_자율,9,FALSE)=\"\",\"\",IF(메인!$J$8>=7,메인!$F$24,\"\"))","v":""},{"$f":"IF(VLOOKUP(C280,평가결과_자율,9,FALSE)=\"\",\"\",VLOOKUP(C280,평가결과_자율,9,FALSE))","v":""}]
[{"$nulls":8},{"$f":"메인!D4&\"학업성적관리위원회\"","v":"충남중학교학업성적관리위원회"}]

{"sheet":"개인성적표","index":21,"n_rows":24,"n_cols":13,"rows_kept":24,"merged":[[1,2,1,10],[3,3,3,4],[5,7,5,8],[5,9,5,10],[6,7,6,8],[7,7,7,8],[9,4,9,10],[10,2,15,2],[10,3,15,3],[12,4,15,9],[12,10,15,10],[16,2,21,2],[16,3,21,3],[18,4,21,9],[18,10,21,10],[22,3,22,4],[22,8,22,9],[23,7,23,10]]}
[]
[null,null,"자유학기 과정 중심 평가 결과 - 개인별 성적표"]
[]
[null,null,"학교명",{"$f":"IF(메인!D4=\"\",\"\",메인!D4)","v":"충남중학교"},null,"학년도",{"$f":"IF(메인!G4=\"\",\"\",메인!G4)","v":2018},"학기",{"$f":"IF(메인!I4=\"\",\"\",메인!I4)","v":2},"학년",{"$f":"IF(메인!K4=\"\",\"\",메인!K4)","v":1}]
[]
[null,null,"반",{"$f":"IF(메인!D6=\"\",\"\",메인!D6)","v":1},"과정명","시수","지도교사","NEIS 과목(영역)",null,"학생 선택"]
[null,null,"과목",{"$f":"IF(메인!D7=\"\",\"\",메인!D7)","v":"기술·가정"},"교과",{"$f":"IF(메인!F7=\"\",\"\",메인!F7)","v":34},{"$f":"IF(메인!G7=\"\",\"\",메인!G7)","v":"김교과"},{"$f":"IF(메인!H7=\"\",\"\",메인!H7)","v":"기술·가정"},null,"번호","이름",null,11]
[null,null,"총시수",{"$f":"IF(메인!D8=\"\",\"\",메인!D8)","v":51},"자유학기 활동",{"$f":"IF(메인!F8=\"\",\"\",메인!F8)","v":17},{"$f":"IF(메인!G8=\"\",\"\",메인!G8)","v":"이자유"},{"$f":"IF(메인!H8=\"\",\"\",메인!H8)","v":"주제선택 활동"},null,1,{"$f":"IF(VLOOKUP(J8,학적,2,FALSE)=\"\",\"\",VLOOKUP(J8,학적,2,FALSE))","v":"학생 1"},null,20]
[]
[null,null,"과정","프로그램","평가 요소별 평가 결과"]
[null,null,"교과","청소년의 생활, 건설기술의 발달",{"$f":"IF(메인!F11=\"\",\"\",메인!F11)","v":"형성평가 - 질문법"},{"$f":"IF(메인!F12=\"\",\"\",메인!F12)","v":"형성평가 - 평가지"},{"$f":"IF(메인!F13=\"\",\"\",메인!F13)","v":"포트폴리오 - 학습활동지"},{"$f":"IF(메인!F14=\"\",\"\",메인!F14)","v":"마인드 맵 작성"},{"$f":"IF(메인!F15=\"\",\"\",메인!F15)","v":""},{"$f":"IF(메인!F16=\"\",\"\",메인!F16)","v":""},{"$f":"IF(메인!F17=\"\",\"\",메인!F17)","v":""}]
[{"$nulls":4},{"$f":"VLOOKUP($J$8,평가결과_공통,3,FALSE)","v":"C"},{"$f":"VLOOKUP($J$8,평가결과_공통,4,FALSE)","v":"B"},{"$f":"VLOOKUP($J$8,평가결과_공통,5,FALSE)","v":"A"},{"$f":"VLOOKUP($J$8,평가결과_공통,6,FALSE)","v":"B"},{"$f":"VLOOKUP($J$8,평가결과_공통,7,FALSE)","v":0},{"$f":"VLOOKUP($J$8,평가결과_공통,8,FALSE)","v":0},{"$f":"VLOOKUP($J$8,평가결과_공통,9,FALSE)","v":0}]
[{"$nulls":4},{"$f":"VLOOKUP($J$8,NEIS_교과!C7:I286,5,FALSE)","v":"질문의 핵심 내용에 대한 이해가 부족하여 답변의 내용이 부실하였으며, 단원에 대한 기본적인 학습활동이 다소 부족하나 일반적인 용어의 개념파악이 양호함. 수업활동에 적극적인 태도를 가지고 학습활동지를 수업과 연계하여 충실히 작성함으로써 교사의 질문에 대한 핵심 내용을 잘 파악하여 정확한 답변을 할 수 있는 학습 능력을 발휘함. 시각적으로 아이디어를 디자인하여 알기 쉽게 표현하는 알마인드맵 프로그램의 기본적인 기능을 활용 할 수 있음. 생활 속의 문제를 발견하고 해결하고자 하는 일반적인 노력을 마인드맵 프로그램으로 알맞게 표현함. 토픽과 서브토픽의 디자인 표현이 대체로 잘 되어있고 안정감 있게 배치되었음."},{"$nulls":5},{"$f":"IF(E13=\"\",\"\",LEN(E13))","v":{"v":340,"d":"340 자"}}]
[]
[]
[]
[null,null,"자유학기\n활동","진로탐색 창의공작",{"$f":"IF(메인!F18=\"\",\"\",메인!F18)","v":"재료의 가공"},{"$f":"IF(메인!F19=\"\",\"\",메인!F19)","v":"전통 한옥 목재 맞춤 제작"},{"$f":"IF(메인!F20=\"\",\"\",메인!F20)","v":"창의적 계단 모형 만들기"},{"$f":"IF(메인!F21=\"\",\"\",메인!F21)","v":"창의적 모형주택 만들기"},{"$f":"IF(메인!F22=\"\",\"\",메인!F22)","v":"창의적 교량 만들기"},{"$f":"IF(메인!F23=\"\",\"\",메인!F23)","v":""},{"$f":"IF(메인!F24=\"\",\"\",메인!F24)","v":""}]
[{"$nulls":4},{"$f":"VLOOKUP($J$8,평가결과_자율,3,FALSE)","v":"A"},{"$f":"VLOOKUP($J$8,평가결과_자율,4,FALSE)","v":"C"},{"$f":"VLOOKUP($J$8,평가결과_자율,5,FALSE)","v":"A"},{"$f":"VLOOKUP($J$8,평가결과_자율,6,FALSE)","v":"B"},{"$f":"VLOOKUP($J$8,평가결과_자율,7,FALSE)","v":"C"},{"$f":"VLOOKUP($J$8,평가결과_자율,8,FALSE)","v":0},{"$f":"VLOOKUP($J$8,평가결과_자율,9,FALSE)","v":0}]
[{"$nulls":4},{"$f":"VLOOKUP($J$8,NEIS_자유!C7:I286,5,FALSE)","v":"안전 수칙을 준수하며 도구를 이용한 각종 재료(하드보드지, 우드락, 폼보드, 목재)의 자르기를 원하는 치수와 모양대로 안정감 있게 잘 하였음. 한옥의 짜맞춤 구조물 만들기 과정에 대한 부품 제작 및 조립 기능이 부족하여 완성도가 낮음. 실내외 통로 구조물로서 입체적인 계단의 구성 및 벽면과의 배치가 매우 잘 되었음. 4인 가족의 주거공간 구상과 설계가 평범한 상태에서 주어진 재료를 이용한 주택 구상과 설계는 다소 미흡하나 가공 및 조립과 꾸미기로 모형주택을 적당하게 만들었음."},{"$nulls":5},{"$f":"IF(E19=\"\",\"\",LEN(E19))","v":{"v":268,"d":"268 자"}}]
[]
[]
[]
[null,null,"학생\n확인",{"$f":"D4","v":"충남중학교"},null,{"$f":"K4&J4","v":"1학년"},{"$f":"D6&C6","v":"1반"},{"$f":"J8&\"번\"","v":"1번"},{"$f":"K8","v":"학생 1"},null,"(서명)"]
[{"$nulls":7},{"$f":"D4&\"학업성적관리위원회\"","v":"충남중학교학업성적관리위원회"}]